BDBM50290670 5-Mercapto-5-[(S)-3-methyl-1-((S)-1-methylcarbamoyl-2-phenyl-ethylcarbamoyl)-butylcarbamoyl]-pentanoic acid methyl ester::CHEMBL93320
SMILES: CNC(=O)[C@H](Cc1ccccc1)NC(=O)[C@H](CC(C)C)NC(=O)C(S)CCCC(=O)OC
InChI Key: InChIKey=CXNJLMYOAJTOHP-ADUPEVMXSA-N
Data: 3 IC50
Activity Spreadsheet -- Enzyme Inhibition Constant Data from BindingDB
Found 3 hits for monomerid = 50290670
Trg + Lig
Ki
nM
ΔG°
kcal/mole
IC50
nM
Kd
nM
EC50/IC50
nM
koff
s-1
kon
M-1s-1
pHTemp
°C
Matrix metalloproteinase-9
(Homo sapiens (Human))
BDBM50290670
(5-Mercapto-5-[(S)-3-methyl-1-((S)-1-methylcarbamoy...)
Show SMILES CNC(=O)[C@H](Cc1ccccc1)NC(=O)[C@H](CC(C)C)NC(=O)C(S)CCCC(=O)OC
Show InChI InChI=1S/C23H35N3O5S/c1-15(2)13-17(26-23(30)19(32)11-8-12-20(27)31-4)22(29)25-18(21(28)24-3)14-16-9-6-5-7-10-16/h5-7,9-10,15,17-19,32H,8,11-14H2,1-4H3,(H,24,28)(H,25,29)(H,26,30)/t17-,18-,19?/m0/s1
Reactome pathway
n/an/a 1n/an/an/an/an/an/a
TBA
Curated by ChEMBL
Assay Description
Inhibition of matrix metalloproteinase-9, MMP-9
Bioorg Med Chem Lett 7: 2765-2770 (1997)
Article DOI: 10.1016/S0960-894X(97)10069-5
BindingDB Entry DOI: 10.7270/Q29G5MTB
Neutrophil collagenase
(Homo sapiens (Human))
BDBM50290670
(5-Mercapto-5-[(S)-3-methyl-1-((S)-1-methylcarbamoy...)
Show SMILES CNC(=O)[C@H](Cc1ccccc1)NC(=O)[C@H](CC(C)C)NC(=O)C(S)CCCC(=O)OC
Show InChI InChI=1S/C23H35N3O5S/c1-15(2)13-17(26-23(30)19(32)11-8-12-20(27)31-4)22(29)25-18(21(28)24-3)14-16-9-6-5-7-10-16/h5-7,9-10,15,17-19,32H,8,11-14H2,1-4H3,(H,24,28)(H,25,29)(H,26,30)/t17-,18-,19?/m0/s1
Reactome pathway
n/an/a 14n/an/an/an/an/an/a
TBA
Curated by ChEMBL
Assay Description
Inhibition of matrix metalloproteinase-8, MMP-8
Bioorg Med Chem Lett 7: 2765-2770 (1997)
Article DOI: 10.1016/S0960-894X(97)10069-5
BindingDB Entry DOI: 10.7270/Q29G5MTB
Stromelysin-1
(Homo sapiens (Human))
BDBM50290670
(5-Mercapto-5-[(S)-3-methyl-1-((S)-1-methylcarbamoy...)
Show SMILES CNC(=O)[C@H](Cc1ccccc1)NC(=O)[C@H](CC(C)C)NC(=O)C(S)CCCC(=O)OC
Show InChI InChI=1S/C23H35N3O5S/c1-15(2)13-17(26-23(30)19(32)11-8-12-20(27)31-4)22(29)25-18(21(28)24-3)14-16-9-6-5-7-10-16/h5-7,9-10,15,17-19,32H,8,11-14H2,1-4H3,(H,24,28)(H,25,29)(H,26,30)/t17-,18-,19?/m0/s1
Reactome pathway
n/an/a 490n/an/an/an/an/an/a
TBA
Curated by ChEMBL
Assay Description
Inhibition of matrix metalloproteinase-3, MMP-3
Bioorg Med Chem Lett 7: 2765-2770 (1997)
Article DOI: 10.1016/S0960-894X(97)10069-5
BindingDB Entry DOI: 10.7270/Q29G5MTB