BDBM50290838 4-(3-Bromo-phenoxy)-6,7-dimethoxy-quinazoline::CHEMBL98798
SMILES: COc1cc2ncnc(Oc3cccc(Br)c3)c2cc1OC
InChI Key: InChIKey=BRHOGFZRGDIAMT-UHFFFAOYSA-N
Data: 4 IC50
Activity Spreadsheet -- Enzyme Inhibition Constant Data from BindingDB
Found 4 hits for monomerid = 50290838
Trg + Lig
Ki
nM
ΔG°
kcal/mole
IC50
nM
Kd
nM
EC50/IC50
nM
koff
s-1
kon
M-1s-1
pHTemp
°C
Epidermal growth factor receptor
(Homo sapiens (Human))
BDBM50290838
(4-(3-Bromo-phenoxy)-6,7-dimethoxy-quinazoline | CH...)
Show SMILES COc1cc2ncnc(Oc3cccc(Br)c3)c2cc1OC
Show InChI InChI=1S/C16H13BrN2O3/c1-20-14-7-12-13(8-15(14)21-2)18-9-19-16(12)22-11-5-3-4-10(17)6-11/h3-9H,1-2H3
n/an/a 70n/an/an/an/an/an/a
TBA
Curated by ChEMBL
Assay Description
Inhibition of epidermal growth factor receptor (EGF-R) autophosphorylation in A431 cells
Bioorg Med Chem Lett 7: 2935-2940 (1997)
Article DOI: 10.1016/S0960-894X(97)10117-2
BindingDB Entry DOI: 10.7270/Q20Z738R
Vascular endothelial growth factor receptor 2
(Homo sapiens (Human))
BDBM50290838
(4-(3-Bromo-phenoxy)-6,7-dimethoxy-quinazoline | CH...)
Show SMILES COc1cc2ncnc(Oc3cccc(Br)c3)c2cc1OC
Show InChI InChI=1S/C16H13BrN2O3/c1-20-14-7-12-13(8-15(14)21-2)18-9-19-16(12)22-11-5-3-4-10(17)6-11/h3-9H,1-2H3
NCI pathway
Reactome pathway
n/an/a 9.80E+3n/an/an/an/an/an/a
Univ Lille Nord de France, F-59000 Lille, France; UDSL, ICPAL, EA 4481, F-59006 Lille, France.
Curated by ChEMBL
Assay Description
Inhibition of recombinant human VEGFR-2-mediated poly(Glu4Tyr) phosphorylation after 1 hr
Bioorg Med Chem Lett 21: 2106-12 (2011)
Article DOI: 10.1016/j.bmcl.2011.01.137
BindingDB Entry DOI: 10.7270/Q2C24WRV
Epidermal growth factor receptor
(Homo sapiens (Human))
BDBM50290838
(4-(3-Bromo-phenoxy)-6,7-dimethoxy-quinazoline | CH...)
Show SMILES COc1cc2ncnc(Oc3cccc(Br)c3)c2cc1OC
Show InChI InChI=1S/C16H13BrN2O3/c1-20-14-7-12-13(8-15(14)21-2)18-9-19-16(12)22-11-5-3-4-10(17)6-11/h3-9H,1-2H3
n/an/a 7.60E+3n/an/an/an/an/an/a
Univ Lille Nord de France, F-59000 Lille, France; UDSL, ICPAL, EA 4481, F-59006 Lille, France.
Curated by ChEMBL
Assay Description
Inhibition of human EGFR-mediated poly(Glu4Tyr) phosphorylation after 1 hr
Bioorg Med Chem Lett 21: 2106-12 (2011)
Article DOI: 10.1016/j.bmcl.2011.01.137
BindingDB Entry DOI: 10.7270/Q2C24WRV
Platelet-derived growth factor receptor (PDGFr)
(Rattus norvegicus)
BDBM50290838
(4-(3-Bromo-phenoxy)-6,7-dimethoxy-quinazoline | CH...)
Show SMILES COc1cc2ncnc(Oc3cccc(Br)c3)c2cc1OC
Show InChI InChI=1S/C16H13BrN2O3/c1-20-14-7-12-13(8-15(14)21-2)18-9-19-16(12)22-11-5-3-4-10(17)6-11/h3-9H,1-2H3
Reactome pathway
n/an/a 1.48E+4n/an/an/an/an/an/a
TBA
Curated by ChEMBL
Assay Description
Inhibition of PDGF-BB induced PDGF-B receptor autophosphorylation in rat mesangial cells.
Bioorg Med Chem Lett 7: 2935-2940 (1997)
Article DOI: 10.1016/S0960-894X(97)10117-2
BindingDB Entry DOI: 10.7270/Q20Z738R