BDBM50290850 3-(6,7-Dimethoxy-quinolin-4-yloxy)-phenol::CHEMBL101389
SMILES: COc1cc2nccc(Oc3cccc(O)c3)c2cc1OC
InChI Key: InChIKey=CGIFTRWAYIWEGG-UHFFFAOYSA-N
Data: 1 IC50
Activity Spreadsheet -- Enzyme Inhibition Constant Data from BindingDB
Found 1 hit for monomerid = 50290850
Trg + Lig
Ki
nM
ΔG°
kcal/mole
IC50
nM
Kd
nM
EC50/IC50
nM
koff
s-1
kon
M-1s-1
pHTemp
°C
Platelet-derived growth factor receptor (PDGFr)
(Rattus norvegicus)
BDBM50290850
(3-(6,7-Dimethoxy-quinolin-4-yloxy)-phenol | CHEMBL...)
Show SMILES COc1cc2nccc(Oc3cccc(O)c3)c2cc1OC
Show InChI InChI=1S/C17H15NO4/c1-20-16-9-13-14(10-17(16)21-2)18-7-6-15(13)22-12-5-3-4-11(19)8-12/h3-10,19H,1-2H3
Reactome pathway
n/an/a 560n/an/an/an/an/an/a
TBA
Curated by ChEMBL
Assay Description
Inhibition of PDGF-BB induced PDGF-B receptor autophosphorylation in rat mesangial cells.
Bioorg Med Chem Lett 7: 2935-2940 (1997)
Article DOI: 10.1016/S0960-894X(97)10117-2
BindingDB Entry DOI: 10.7270/Q20Z738R