BDBM50290859 5-{3-[1-(3,5-Bis-trifluoromethyl-phenyl)-ethoxy]-2-phenyl-piperidin-1-ylmethyl}-2,4-dihydro-[1,2,4]triazol-3-one::CHEMBL98524
SMILES: C[C@@H](O[C@H]1CCCN(Cc2n[nH]c(=O)[nH]2)[C@H]1c1ccccc1)c1cc(cc(c1)C(F)(F)F)C(F)(F)F
InChI Key: InChIKey=XFBNCYABIIKUDT-RFVSGWPVSA-N
Data: 1 IC50
Activity Spreadsheet -- Enzyme Inhibition Constant Data from BindingDB
Found 1 hit for monomerid = 50290859
Trg + Lig
Ki
nM
ΔG°
kcal/mole
IC50
nM
Kd
nM
EC50/IC50
nM
koff
s-1
kon
M-1s-1
pHTemp
°C
Neurokinin 1 receptor
(Rattus norvegicus (rat))
BDBM50290859
(5-{3-[1-(3,5-Bis-trifluoromethyl-phenyl)-ethoxy]-2...)
Show SMILES C[C@@H](O[C@H]1CCCN(Cc2n[nH]c(=O)[nH]2)[C@H]1c1ccccc1)c1cc(cc(c1)C(F)(F)F)C(F)(F)F
Show InChI InChI=1S/C24H24F6N4O2/c1-14(16-10-17(23(25,26)27)12-18(11-16)24(28,29)30)36-19-8-5-9-34(13-20-31-22(35)33-32-20)21(19)15-6-3-2-4-7-15/h2-4,6-7,10-12,14,19,21H,5,8-9,13H2,1H3,(H2,31,32,33,35)/t14-,19+,21+/m1/s1
Reactome pathway
n/an/a 0.160n/an/an/an/an/an/a
TBA
Curated by ChEMBL
Assay Description
Antagonism of NK1 receptor in rat liver microsomes.
Bioorg Med Chem Lett 7: 2959-2962 (1997)
Article DOI: 10.1016/S0960-894X(97)10118-4
BindingDB Entry DOI: 10.7270/Q2W66KRX