BDBM50290861 5-{3-[1-(3,5-Dichloro-phenyl)-ethoxy]-2-phenyl-piperidin-1-ylmethyl}-2,4-dihydro-[1,2,4]triazol-3-one::CHEMBL100636
SMILES: C[C@@H](O[C@H]1CCCN(Cc2n[nH]c(=O)[nH]2)[C@H]1c1ccccc1)c1cc(Cl)cc(Cl)c1
InChI Key: InChIKey=IBZJAXSAZUPUBI-RFVSGWPVSA-N
Data: 1 IC50
Activity Spreadsheet -- Enzyme Inhibition Constant Data from BindingDB
Found 1 hit for monomerid = 50290861
Trg + Lig
Ki
nM
ΔG°
kcal/mole
IC50
nM
Kd
nM
EC50/IC50
nM
koff
s-1
kon
M-1s-1
pHTemp
°C
Neurokinin 1 receptor
(Rattus norvegicus (rat))
BDBM50290861
(5-{3-[1-(3,5-Dichloro-phenyl)-ethoxy]-2-phenyl-pip...)
Show SMILES C[C@@H](O[C@H]1CCCN(Cc2n[nH]c(=O)[nH]2)[C@H]1c1ccccc1)c1cc(Cl)cc(Cl)c1
Show InChI InChI=1S/C22H24Cl2N4O2/c1-14(16-10-17(23)12-18(24)11-16)30-19-8-5-9-28(13-20-25-22(29)27-26-20)21(19)15-6-3-2-4-7-15/h2-4,6-7,10-12,14,19,21H,5,8-9,13H2,1H3,(H2,25,26,27,29)/t14-,19+,21+/m1/s1
Reactome pathway
n/an/a 0.0900n/an/an/an/an/an/a
TBA
Curated by ChEMBL
Assay Description
Antagonism of NK1 receptor in rat liver microsomes.
Bioorg Med Chem Lett 7: 2959-2962 (1997)
Article DOI: 10.1016/S0960-894X(97)10118-4
BindingDB Entry DOI: 10.7270/Q2W66KRX