BDBM50291103 (6,7-Dimethoxy-quinazolin-4-yl)-methyl-(3-trifluoromethyl-phenyl)-amine; hydrochloride::CHEMBL539807
SMILES: COc1cc2ncnc(N(C)c3cccc(c3)C(F)(F)F)c2cc1OC
InChI Key: InChIKey=PNFNUKCRDMUSSD-UHFFFAOYSA-N
Data: 2 IC50
Activity Spreadsheet -- Enzyme Inhibition Constant Data from BindingDB
Found 2 hits for monomerid = 50291103
Trg + Lig
Ki
nM
ΔG°
kcal/mole
IC50
nM
Kd
nM
EC50/IC50
nM
koff
s-1
kon
M-1s-1
pHTemp
°C
Epidermal growth factor receptor
(Homo sapiens (Human))
BDBM50291103
((6,7-Dimethoxy-quinazolin-4-yl)-methyl-(3-trifluor...)
Show SMILES COc1cc2ncnc(N(C)c3cccc(c3)C(F)(F)F)c2cc1OC
Show InChI InChI=1S/C18H16F3N3O2/c1-24(12-6-4-5-11(7-12)18(19,20)21)17-13-8-15(25-2)16(26-3)9-14(13)22-10-23-17/h4-10H,1-3H3
n/an/a 3.00E+4n/an/an/an/an/an/a
TBA
Curated by ChEMBL
Assay Description
Antagonism towards Epidermal growth factor receptor
Bioorg Med Chem Lett 7: 421-424 (1997)
Article DOI: 10.1016/S0960-894X(97)00035-8
BindingDB Entry DOI: 10.7270/Q2SB45RN
Macrophage colony stimulating factor receptor
(Homo sapiens (Human))
BDBM50291103
((6,7-Dimethoxy-quinazolin-4-yl)-methyl-(3-trifluor...)
Show SMILES COc1cc2ncnc(N(C)c3cccc(c3)C(F)(F)F)c2cc1OC
Show InChI InChI=1S/C18H16F3N3O2/c1-24(12-6-4-5-11(7-12)18(19,20)21)17-13-8-15(25-2)16(26-3)9-14(13)22-10-23-17/h4-10H,1-3H3
n/an/a 500n/an/an/an/an/an/a
TBA
Curated by ChEMBL
Assay Description
Antagonism towards Colony stimulating factor 1 receptor (CSF-1R)
Bioorg Med Chem Lett 7: 421-424 (1997)
Article DOI: 10.1016/S0960-894X(97)00035-8
BindingDB Entry DOI: 10.7270/Q2SB45RN