BDBM50291104 (6-Methoxy-quinazolin-4-yl)-methyl-phenyl-amine; hydrochloride::CHEMBL542955
SMILES: COc1ccc2ncnc(N(C)c3ccccc3)c2c1
InChI Key: InChIKey=GSPGBVVWNZTJCF-UHFFFAOYSA-N
Data: 2 IC50
Activity Spreadsheet -- Enzyme Inhibition Constant Data from BindingDB
Found 2 hits for monomerid = 50291104
Trg + Lig
Ki
nM
ΔG°
kcal/mole
IC50
nM
Kd
nM
EC50/IC50
nM
koff
s-1
kon
M-1s-1
pHTemp
°C
Epidermal growth factor receptor
(Homo sapiens (Human))
BDBM50291104
((6-Methoxy-quinazolin-4-yl)-methyl-phenyl-amine; h...)
Show SMILES COc1ccc2ncnc(N(C)c3ccccc3)c2c1
Show InChI InChI=1S/C16H15N3O/c1-19(12-6-4-3-5-7-12)16-14-10-13(20-2)8-9-15(14)17-11-18-16/h3-11H,1-2H3
n/an/a>2.00E+4n/an/an/an/an/an/a
TBA
Curated by ChEMBL
Assay Description
Antagonism towards Epidermal growth factor receptor
Bioorg Med Chem Lett 7: 421-424 (1997)
Article DOI: 10.1016/S0960-894X(97)00035-8
BindingDB Entry DOI: 10.7270/Q2SB45RN
Macrophage colony stimulating factor receptor
(Homo sapiens (Human))
BDBM50291104
((6-Methoxy-quinazolin-4-yl)-methyl-phenyl-amine; h...)
Show SMILES COc1ccc2ncnc(N(C)c3ccccc3)c2c1
Show InChI InChI=1S/C16H15N3O/c1-19(12-6-4-3-5-7-12)16-14-10-13(20-2)8-9-15(14)17-11-18-16/h3-11H,1-2H3
n/an/a 2.00E+4n/an/an/an/an/an/a
TBA
Curated by ChEMBL
Assay Description
Antagonism towards Colony stimulating factor 1 receptor (CSF-1R)
Bioorg Med Chem Lett 7: 421-424 (1997)
Article DOI: 10.1016/S0960-894X(97)00035-8
BindingDB Entry DOI: 10.7270/Q2SB45RN