BDBM50291108 (2-Chloro-6,7-dimethoxy-quinazolin-4-yl)-methyl-phenyl-amine::CHEMBL135417
SMILES: COc1cc2nc(Cl)nc(N(C)c3ccccc3)c2cc1OC
InChI Key: InChIKey=HMSJUFNKRZCJPT-UHFFFAOYSA-N
Data: 2 IC50
Activity Spreadsheet -- Enzyme Inhibition Constant Data from BindingDB
Found 2 hits for monomerid = 50291108
Trg + Lig
Ki
nM
ΔG°
kcal/mole
IC50
nM
Kd
nM
EC50/IC50
nM
koff
s-1
kon
M-1s-1
pHTemp
°C
Epidermal growth factor receptor
(Homo sapiens (Human))
BDBM50291108
((2-Chloro-6,7-dimethoxy-quinazolin-4-yl)-methyl-ph...)
Show SMILES COc1cc2nc(Cl)nc(N(C)c3ccccc3)c2cc1OC
Show InChI InChI=1S/C17H16ClN3O2/c1-21(11-7-5-4-6-8-11)16-12-9-14(22-2)15(23-3)10-13(12)19-17(18)20-16/h4-10H,1-3H3
n/an/a>5.00E+4n/an/an/an/an/an/a
TBA
Curated by ChEMBL
Assay Description
Antagonism towards Epidermal growth factor receptor
Bioorg Med Chem Lett 7: 421-424 (1997)
Article DOI: 10.1016/S0960-894X(97)00035-8
BindingDB Entry DOI: 10.7270/Q2SB45RN
Macrophage colony stimulating factor receptor
(Homo sapiens (Human))
BDBM50291108
((2-Chloro-6,7-dimethoxy-quinazolin-4-yl)-methyl-ph...)
Show SMILES COc1cc2nc(Cl)nc(N(C)c3ccccc3)c2cc1OC
Show InChI InChI=1S/C17H16ClN3O2/c1-21(11-7-5-4-6-8-11)16-12-9-14(22-2)15(23-3)10-13(12)19-17(18)20-16/h4-10H,1-3H3
n/an/a>5.00E+4n/an/an/an/an/an/a
TBA
Curated by ChEMBL
Assay Description
Antagonism towards Colony stimulating factor 1 receptor (CSF-1R)
Bioorg Med Chem Lett 7: 421-424 (1997)
Article DOI: 10.1016/S0960-894X(97)00035-8
BindingDB Entry DOI: 10.7270/Q2SB45RN