BDBM50291112 CHEMBL541334::Methyl-phenyl-(1H-pyrazolo[3,4-d]pyrimidin-4-yl)-amine; hydrochloride
SMILES: CN(c1ccccc1)c1ncnc2n[nH]cc12
InChI Key: InChIKey=NFRNOXHMHWKKAX-UHFFFAOYSA-N
Data: 2 IC50
Activity Spreadsheet -- Enzyme Inhibition Constant Data from BindingDB
Found 2 hits for monomerid = 50291112
Trg + Lig
Ki
nM
ΔG°
kcal/mole
IC50
nM
Kd
nM
EC50/IC50
nM
koff
s-1
kon
M-1s-1
pHTemp
°C
Epidermal growth factor receptor
(Homo sapiens (Human))
BDBM50291112
(CHEMBL541334 | Methyl-phenyl-(1H-pyrazolo[3,4-d]py...)
Show SMILES CN(c1ccccc1)c1ncnc2n[nH]cc12
Show InChI InChI=1S/C12H11N5/c1-17(9-5-3-2-4-6-9)12-10-7-15-16-11(10)13-8-14-12/h2-8H,1H3,(H,13,14,15,16)
n/an/a>5.00E+4n/an/an/an/an/an/a
TBA
Curated by ChEMBL
Assay Description
Antagonism towards Epidermal growth factor receptor
Bioorg Med Chem Lett 7: 421-424 (1997)
Article DOI: 10.1016/S0960-894X(97)00035-8
BindingDB Entry DOI: 10.7270/Q2SB45RN
Macrophage colony stimulating factor receptor
(Homo sapiens (Human))
BDBM50291112
(CHEMBL541334 | Methyl-phenyl-(1H-pyrazolo[3,4-d]py...)
Show SMILES CN(c1ccccc1)c1ncnc2n[nH]cc12
Show InChI InChI=1S/C12H11N5/c1-17(9-5-3-2-4-6-9)12-10-7-15-16-11(10)13-8-14-12/h2-8H,1H3,(H,13,14,15,16)
n/an/a 600n/an/an/an/an/an/a
TBA
Curated by ChEMBL
Assay Description
Antagonism towards Colony stimulating factor 1 receptor (CSF-1R)
Bioorg Med Chem Lett 7: 421-424 (1997)
Article DOI: 10.1016/S0960-894X(97)00035-8
BindingDB Entry DOI: 10.7270/Q2SB45RN