BDBM50291192 CHEMBL345337::[(S)-1-[(R)-1-((R)-1-Formyl-3-methyl-butylcarbamoyl)-3-methyl-butylcarbamoyl]-2-(4-hydroxy-phenyl)-ethyl]-carbamic acid benzyl ester
SMILES: CC(C)C[C@@H](NC(=O)[C@@H](CC(C)C)NC(=O)[C@H](Cc1ccc(O)cc1)NC(=O)OCc1ccccc1)C=O
InChI Key: InChIKey=WQRMOCQQDGGYLR-ARMFNRFLSA-N
Data: 1 IC50
Activity Spreadsheet -- Enzyme Inhibition Constant Data from BindingDB
Found 1 hit for monomerid = 50291192
Trg + Lig
Ki
nM
ΔG°
kcal/mole
IC50
nM
Kd
nM
EC50/IC50
nM
koff
s-1
kon
M-1s-1
pHTemp
°C
Calpain1
(Homo sapiens (Human))
BDBM50291192
(CHEMBL345337 | [(S)-1-[(R)-1-((R)-1-Formyl-3-methy...)
Show SMILES CC(C)C[C@@H](NC(=O)[C@@H](CC(C)C)NC(=O)[C@H](Cc1ccc(O)cc1)NC(=O)OCc1ccccc1)C=O
Show InChI InChI=1S/C29H39N3O6/c1-19(2)14-23(17-33)30-27(35)25(15-20(3)4)31-28(36)26(16-21-10-12-24(34)13-11-21)32-29(37)38-18-22-8-6-5-7-9-22/h5-13,17,19-20,23,25-26,34H,14-16,18H2,1-4H3,(H,30,35)(H,31,36)(H,32,37)/t23-,25-,26+/m1/s1
Reactome pathway
n/an/a 8n/an/an/an/an/an/a
TBA
Curated by ChEMBL
Assay Description
Inhibitory activity evaluated against recombinant human calpain 1
Bioorg Med Chem Lett 7: 539-544 (1997)
Article DOI: 10.1016/S0960-894X(97)00063-2
BindingDB Entry DOI: 10.7270/Q2W37WBM