null
SMILES: NC(=N)c1ccc(CC(=O)NCCC[C@@H](CC(O)=O)NC(=O)CCC23C[C@H]4C[C@H](C[C@H](C4)C2)C3)cc1
InChI Key: InChIKey=XQUJDYKAECREGU-QXWDULSGSA-N
Activity Spreadsheet -- Enzyme Inhibition Constant Data from BindingDB
Found 1 hit for monomerid = 50291336
Trg + Lig
Ki
nM
ΔG°
kcal/mole
IC50
nM
Kd
nM
EC50/IC50
nM
koff
s-1
kon
M-1s-1
pHTemp
°C
Integrin alpha-IIb/beta-3
(Homo sapiens (Human))
BDBM50291336
((S)-3-(3-Adamantan-1-yl-propionylamino)-6-[2-(4-ca...)
Show SMILES NC(=N)c1ccc(CC(=O)NCCC[C@@H](CC(O)=O)NC(=O)CCC23C[C@H]4C[C@H](C[C@H](C4)C2)C3)cc1 |TLB:23:24:27:30.31.29,THB:23:24:26.31.27:29,32:24:27:30.31.29,25:24:26.31.27:29,25:26:24.32.33:29|
Show InChI InChI=1S/C28H40N4O4/c29-27(30)22-5-3-18(4-6-22)13-25(34)31-9-1-2-23(14-26(35)36)32-24(33)7-8-28-15-19-10-20(16-28)12-21(11-19)17-28/h3-6,19-21,23H,1-2,7-17H2,(H3,29,30)(H,31,34)(H,32,33)(H,35,36)/t19-,20+,21-,23-,28?/m0/s1
n/an/a 0.370n/an/an/an/an/an/a
TBA
Curated by ChEMBL
Assay Description
Inhibition of fibrinogen binding to immobilized human glycoprotein alpha IIb beta3 integrin
Bioorg Med Chem Lett 7: 727-732 (1997)
Article DOI: 10.1016/S0960-894X(97)00095-4
BindingDB Entry DOI: 10.7270/Q2KK9BSM