null
SMILES: CC(C)CC(=O)N[C@@H](CCCNC(=O)Cc1ccc(cc1)C(N)=N)CC(O)=O
InChI Key: InChIKey=MDAJFZIQBMXEKL-INIZCTEOSA-N
Activity Spreadsheet -- Enzyme Inhibition Constant Data from BindingDB
Found 1 hit for monomerid = 50291339
Trg + Lig
Ki
nM
ΔG°
kcal/mole
IC50
nM
Kd
nM
EC50/IC50
nM
koff
s-1
kon
M-1s-1
pHTemp
°C
Integrin alpha-IIb/beta-3
(Homo sapiens (Human))
BDBM50291339
((S)-6-[2-(4-Carbamimidoyl-phenyl)-acetylamino]-3-(...)
Show SMILES CC(C)CC(=O)N[C@@H](CCCNC(=O)Cc1ccc(cc1)C(N)=N)CC(O)=O
Show InChI InChI=1S/C20H30N4O4/c1-13(2)10-18(26)24-16(12-19(27)28)4-3-9-23-17(25)11-14-5-7-15(8-6-14)20(21)22/h5-8,13,16H,3-4,9-12H2,1-2H3,(H3,21,22)(H,23,25)(H,24,26)(H,27,28)/t16-/m0/s1
n/an/a 1.70n/an/an/an/an/an/a
TBA
Curated by ChEMBL
Assay Description
Inhibition of fibrinogen binding to immobilized human glycoprotein alpha IIb beta3 integrin
Bioorg Med Chem Lett 7: 727-732 (1997)
Article DOI: 10.1016/S0960-894X(97)00095-4
BindingDB Entry DOI: 10.7270/Q2KK9BSM