BDBM50291387 3-{(E)-3-Carboxy-1-[1-(6-decyloxy-naphthalen-2-yl)-meth-(E)-ylidene]-2-methyl-allyl}-benzoic acid::CHEMBL354938
SMILES: CCCCCCCCCCOc1ccc2cc(\C=C(\C(\C)=C\C(O)=O)/c3cccc(c3)C(O)=O)ccc2c1
InChI Key: InChIKey=REBGCEBWAGPYAM-MDDTUJLASA-N
Data: 1 IC50
Activity Spreadsheet -- Enzyme Inhibition Constant Data from BindingDB
Found 1 hit for monomerid = 50291387
Trg + Lig
Ki
nM
ΔG°
kcal/mole
IC50
nM
Kd
nM
EC50/IC50
nM
koff
s-1
kon
M-1s-1
pHTemp
°C
cPLA2 C2
(Homo sapiens (Human))
BDBM50291387
(3-{(E)-3-Carboxy-1-[1-(6-decyloxy-naphthalen-2-yl)...)
Show SMILES CCCCCCCCCCOc1ccc2cc(\C=C(\C(\C)=C\C(O)=O)/c3cccc(c3)C(O)=O)ccc2c1
Show InChI InChI=1S/C33H38O5/c1-3-4-5-6-7-8-9-10-18-38-30-17-16-26-20-25(14-15-27(26)23-30)21-31(24(2)19-32(34)35)28-12-11-13-29(22-28)33(36)37/h11-17,19-23H,3-10,18H2,1-2H3,(H,34,35)(H,36,37)/b24-19+,31-21-
n/an/a 1.40E+4n/an/an/an/an/an/a
TBA
Curated by ChEMBL
Assay Description
Compound was measured for the inhibition of human platelet PLA2 (HP-PLA2)
Bioorg Med Chem Lett 7: 793-798 (1997)
Article DOI: 10.1016/S0960-894X(97)00110-8
BindingDB Entry DOI: 10.7270/Q26D5T0F