BDBM50291562 CHEMBL9963::{1-[(R)-2-Biphenyl-4-yl-1-(1H-tetrazol-5-yl)-ethylamino]-2-naphthalen-1-yl-ethyl}-phosphonic acid
SMILES: OP(O)(=O)C(Cc1cccc2ccccc12)N[C@H](Cc1ccc(cc1)-c1ccccc1)c1nnn[nH]1
InChI Key: InChIKey=UGLAENRVRPVULB-DCWQJPKNSA-N
Data: 2 IC50
Activity Spreadsheet -- Enzyme Inhibition Constant Data from BindingDB
Found 2 hits for monomerid = 50291562
Trg + Lig
Ki
nM
ΔG°
kcal/mole
IC50
nM
Kd
nM
EC50/IC50
nM
koff
s-1
kon
M-1s-1
pHTemp
°C
Endothelin-converting enzyme 1 (ECE1)
(Homo sapiens (Human))
BDBM50291562
(CHEMBL9963 | {1-[(R)-2-Biphenyl-4-yl-1-(1H-tetrazo...)
Show SMILES OP(O)(=O)C(Cc1cccc2ccccc12)N[C@H](Cc1ccc(cc1)-c1ccccc1)c1nnn[nH]1
Show InChI InChI=1S/C27H26N5O3P/c33-36(34,35)26(18-23-11-6-10-22-9-4-5-12-24(22)23)28-25(27-29-31-32-30-27)17-19-13-15-21(16-14-19)20-7-2-1-3-8-20/h1-16,25-26,28H,17-18H2,(H2,33,34,35)(H,29,30,31,32)/t25-,26?/m1/s1
n/an/a 160n/an/an/an/an/an/a
TBA
Curated by ChEMBL
Assay Description
In vitro inhibition against recombinant human Endothelin converting enzyme 1 activity
Bioorg Med Chem Lett 7: 1059-1064 (1997)
Article DOI: 10.1016/S0960-894X(97)00159-5
BindingDB Entry DOI: 10.7270/Q2WH2QGK
Neprilysin
(Homo sapiens (Human))
BDBM50291562
(CHEMBL9963 | {1-[(R)-2-Biphenyl-4-yl-1-(1H-tetrazo...)
Show SMILES OP(O)(=O)C(Cc1cccc2ccccc12)N[C@H](Cc1ccc(cc1)-c1ccccc1)c1nnn[nH]1
Show InChI InChI=1S/C27H26N5O3P/c33-36(34,35)26(18-23-11-6-10-22-9-4-5-12-24(22)23)28-25(27-29-31-32-30-27)17-19-13-15-21(16-14-19)20-7-2-1-3-8-20/h1-16,25-26,28H,17-18H2,(H2,33,34,35)(H,29,30,31,32)/t25-,26?/m1/s1
n/an/a 8.80n/an/an/an/an/an/a
TBA
Curated by ChEMBL
Assay Description
Inhibition of neutral endopeptidase 24.11(NEP)
Bioorg Med Chem Lett 7: 1059-1064 (1997)
Article DOI: 10.1016/S0960-894X(97)00159-5
BindingDB Entry DOI: 10.7270/Q2WH2QGK