BDBM50292387 4'-hydroxy-6,3',5'-triprenylisoflavonone::CHEMBL465773
SMILES: [#6]\[#6](-[#6])=[#6]\[#6]-c1cc(cc(-[#6]\[#6]=[#6](\[#6])-[#6])c1-[#8])-[#6]-1-[#6]-[#6](=O)-c2c(-[#8])c(-[#6]\[#6]=[#6](\[#6])-[#6])c(-[#8])cc2-[#8]-1
InChI Key: InChIKey=DEOQQHCFRLUMMX-UHFFFAOYSA-N
Data: 1 IC50
Activity Spreadsheet -- Enzyme Inhibition Constant Data from BindingDB
Found 1 hit for monomerid = 50292387
Trg + Lig
Ki
nM
ΔG°
kcal/mole
IC50
nM
Kd
nM
EC50/IC50
nM
koff
s-1
kon
M-1s-1
pHTemp
°C
Phospholipase A2
(Homo sapiens (Human))
BDBM50292387
(4'-hydroxy-6,3',5'-triprenylisoflavonone | CHEMBL4...)
Show SMILES [#6]\[#6](-[#6])=[#6]\[#6]-c1cc(cc(-[#6]\[#6]=[#6](\[#6])-[#6])c1-[#8])-[#6]-1-[#6]-[#6](=O)-c2c(-[#8])c(-[#6]\[#6]=[#6](\[#6])-[#6])c(-[#8])cc2-[#8]-1
Show InChI InChI=1S/C30H36O5/c1-17(2)7-10-20-13-22(14-21(29(20)33)11-8-18(3)4)26-16-25(32)28-27(35-26)15-24(31)23(30(28)34)12-9-19(5)6/h7-9,13-15,26,31,33-34H,10-12,16H2,1-6H3
Reactome pathway
n/an/a 1.00E+4n/an/an/an/an/an/a
TBA
Curated by ChEMBL
Assay Description
Inhibition of PLA2 in fMLP and A23187 ionophore-stimulated human HL60 cells assessed as effect on [3H]arachidonic acid release
J Nat Prod 60: 537-539 (1997)
Article DOI: 10.1021/np960533e
BindingDB Entry DOI: 10.7270/Q21G0M8S