BDBM50292414 CHEMBL502872::Zaragozic Acid D
SMILES: CCCCCCCC(=O)O[C@@H]1[C@@H](O)[C@]2(CCCC(OC(C)=O)C(C)C\C=C\c3ccccc3)O[C@@]1(C(O)=O)[C@@](O)([C@H](O2)C(O)=O)C(O)=O
InChI Key: InChIKey=CGQGIYLITCUENM-FRHZWACMSA-N
Data: 1 IC50
Activity Spreadsheet -- Enzyme Inhibition Constant Data from BindingDB
Found 1 hit for monomerid = 50292414
Trg + Lig
Ki
nM
ΔG°
kcal/mole
IC50
nM
Kd
nM
EC50/IC50
nM
koff
s-1
kon
M-1s-1
pHTemp
°C
Squalene synthase
(Rattus norvegicus)
BDBM50292414
(CHEMBL502872 | Zaragozic Acid D)
Show SMILES CCCCCCCC(=O)O[C@@H]1[C@@H](O)[C@]2(CCCC(OC(C)=O)C(C)C\C=C\c3ccccc3)O[C@@]1(C(O)=O)[C@@](O)([C@H](O2)C(O)=O)C(O)=O |r|
Show InChI InChI=1S/C34H46O14/c1-4-5-6-7-11-19-25(36)46-27-26(37)32(47-28(29(38)39)33(44,30(40)41)34(27,48-32)31(42)43)20-13-18-24(45-22(3)35)21(2)14-12-17-23-15-9-8-10-16-23/h8-10,12,15-17,21,24,26-28,37,44H,4-7,11,13-14,18-20H2,1-3H3,(H,38,39)(H,40,41)(H,42,43)/b17-12+/t21?,24?,26-,27-,28-,32+,33-,34+/m1/s1
Reactome pathway
n/an/a 6n/an/an/an/an/an/a
TBA
Curated by ChEMBL
Assay Description
Inhibition of rat liver squalene synthase by liqiud scintillation counting
J Nat Prod 56: 1923-1929 (1993)
Article DOI: 10.1021/np50101a009
BindingDB Entry DOI: 10.7270/Q2M908Q1