BDBM50292424 Anacardic acid 10'Z-monoene::CHEMBL470264
SMILES: CCCC\C=C/CCCCCCCCCc1cccc(O)c1C(O)=O
InChI Key: InChIKey=UEOBFNCQTNUCCY-WAYWQWQTSA-N
Data: 2 IC50
Activity Spreadsheet -- Enzyme Inhibition Constant Data from BindingDB
Found 2 hits for monomerid = 50292424
Trg + Lig
Ki
nM
ΔG°
kcal/mole
IC50
nM
Kd
nM
EC50/IC50
nM
koff
s-1
kon
M-1s-1
pHTemp
°C
Acetylcholinesterase
(Electrophorus electricus (Electric eel))
BDBM50292424
(Anacardic acid 10'Z-monoene | CHEMBL470264)
Show SMILES CCCC\C=C/CCCCCCCCCc1cccc(O)c1C(O)=O
Show InChI InChI=1S/C22H34O3/c1-2-3-4-5-6-7-8-9-10-11-12-13-14-16-19-17-15-18-20(23)21(19)22(24)25/h5-6,15,17-18,23H,2-4,7-14,16H2,1H3,(H,24,25)/b6-5-
n/an/a 2.17E+3n/an/an/an/an/an/a
University Putra Malaysia
Curated by ChEMBL
Assay Description
Inhibition of electric eel acetylcholinesterase using acetylthiocholine iodide as substrate after 10 mins by Ellman's spectrophotometric method
Bioorg Med Chem Lett 21: 4097-103 (2011)
Article DOI: 10.1016/j.bmcl.2011.04.065
BindingDB Entry DOI: 10.7270/Q21Z44RM
Lipoxygenase-1
(Glycine max (soybean))
BDBM50292424
(Anacardic acid 10'Z-monoene | CHEMBL470264)
Show SMILES CCCC\C=C/CCCCCCCCCc1cccc(O)c1C(O)=O
Show InChI InChI=1S/C22H34O3/c1-2-3-4-5-6-7-8-9-10-11-12-13-14-16-19-17-15-18-20(23)21(19)22(24)25/h5-6,15,17-18,23H,2-4,7-14,16H2,1H3,(H,24,25)/b6-5-
n/an/a 6.00E+3n/an/an/an/an/an/a
TBA
Curated by ChEMBL
Assay Description
Inhibition of soybean lipoxygenase-1
J Nat Prod 57: 1755-1757 (1994)
Article DOI: 10.1021/np50114a025
BindingDB Entry DOI: 10.7270/Q23B6042