BDBM50292705 (25R)-25-Adamantyl-1alpha,25-dihydroxy-2-methylene-22,23-didehydro-19,26,27-trinor-20-epivitamin D3::CHEMBL466792
SMILES: [#6]-[#6@@H](\[#6]=[#6]\[#6]-[#6@@H](-[#8])C12[#6]-[#6]-3-[#6]-[#6](-[#6]-[#6](-[#6]-3)-[#6]1)-[#6]2)-[#6@H]1-[#6]-[#6]-[#6@H]2\[#6](-[#6]-[#6]-[#6][C@]12[#6])=[#6]\[#6]=[#6]-1/[#6]-[#6@@H](-[#8])-[#6](=[#6])-[#6@H](-[#8])-[#6]-1
InChI Key: InChIKey=MOSWJCBKXGNCIG-IKNSNWIESA-N
Data: 1 IC50  1 EC50
PDB links: 1 PDB ID matches this monomer.
Activity Spreadsheet -- Enzyme Inhibition Constant Data from BindingDB
Found 2 hits for monomerid = 50292705
Trg + Lig
Ki
nM
ΔG°
kcal/mole
IC50
nM
Kd
nM
EC50/IC50
nM
koff
s-1
kon
M-1s-1
pHTemp
°C
Vitamin D3 receptor
(Homo sapiens (Human))
BDBM50292705
((25R)-25-Adamantyl-1alpha,25-dihydroxy-2-methylene...)
Show SMILES [#6]-[#6@@H](\[#6]=[#6]\[#6]-[#6@@H](-[#8])C12[#6]-[#6]-3-[#6]-[#6](-[#6]-[#6](-[#6]-3)-[#6]1)-[#6]2)-[#6@H]1-[#6]-[#6]-[#6@H]2\[#6](-[#6]-[#6]-[#6][C@]12[#6])=[#6]\[#6]=[#6]-1/[#6]-[#6@@H](-[#8])-[#6](=[#6])-[#6@H](-[#8])-[#6]-1 |r,TLB:10:11:9.8.14:15,THB:12:11:8:14.13.15,12:13:10.11.16:8,10:9:11.16.12:15|
Show InChI InChI=1S/C35H52O3/c1-22(6-4-8-33(38)35-19-25-14-26(20-35)16-27(15-25)21-35)29-11-12-30-28(7-5-13-34(29,30)3)10-9-24-17-31(36)23(2)32(37)18-24/h4,6,9-10,22,25-27,29-33,36-38H,2,5,7-8,11-21H2,1,3H3/b6-4+,28-10+/t22-,25?,26?,27?,29+,30-,31+,32+,33+,34+,35?/m0/s1
Reactome pathway
n/an/a 3n/an/an/an/an/an/a
Tokyo Medical and Dental University
Curated by ChEMBL
Assay Description
Antagonist activity at VDR expressed in COS7 cells assessed as inhibition of 1,25-Dihydroxyvitamin D3-induced response by transient transcription ass...
J Med Chem 51: 5320-9 (2008)
Article DOI: 10.1021/jm8004477
BindingDB Entry DOI: 10.7270/Q28C9W2Z
Vitamin D3 receptor
(Homo sapiens (Human))
BDBM50292705
((25R)-25-Adamantyl-1alpha,25-dihydroxy-2-methylene...)
Show SMILES [#6]-[#6@@H](\[#6]=[#6]\[#6]-[#6@@H](-[#8])C12[#6]-[#6]-3-[#6]-[#6](-[#6]-[#6](-[#6]-3)-[#6]1)-[#6]2)-[#6@H]1-[#6]-[#6]-[#6@H]2\[#6](-[#6]-[#6]-[#6][C@]12[#6])=[#6]\[#6]=[#6]-1/[#6]-[#6@@H](-[#8])-[#6](=[#6])-[#6@H](-[#8])-[#6]-1 |r,TLB:10:11:9.8.14:15,THB:12:11:8:14.13.15,12:13:10.11.16:8,10:9:11.16.12:15|
Show InChI InChI=1S/C35H52O3/c1-22(6-4-8-33(38)35-19-25-14-26(20-35)16-27(15-25)21-35)29-11-12-30-28(7-5-13-34(29,30)3)10-9-24-17-31(36)23(2)32(37)18-24/h4,6,9-10,22,25-27,29-33,36-38H,2,5,7-8,11-21H2,1,3H3/b6-4+,28-10+/t22-,25?,26?,27?,29+,30-,31+,32+,33+,34+,35?/m0/s1
Reactome pathway
n/an/an/an/a 1n/an/an/an/a
Tokyo Medical and Dental University
Curated by ChEMBL
Assay Description
Agonist activity at VDR assessed as receptor transactivation by transient transcription assay
J Med Chem 51: 5320-9 (2008)
Article DOI: 10.1021/jm8004477
BindingDB Entry DOI: 10.7270/Q28C9W2Z