null
SMILES: FC(F)(F)c1ccc(cc1)-n1cnnc1SCc1nc(COc2c(Cl)cccc2Cl)no1
InChI Key: InChIKey=UUZRVUXGULNUHU-UHFFFAOYSA-N
Activity Spreadsheet -- Enzyme Inhibition Constant Data from BindingDB
Found 1 hit for monomerid = 50292742
Trg + Lig
Ki
nM
ΔG°
kcal/mole
IC50
nM
Kd
nM
EC50/IC50
nM
koff
s-1
kon
M-1s-1
pHTemp
°C
Epidermal growth factor receptor
(Homo sapiens (Human))
BDBM50292742
(3-((2,6-dichlorophenoxy)methyl)-5-((4-(4-(trifluor...)
Show SMILES FC(F)(F)c1ccc(cc1)-n1cnnc1SCc1nc(COc2c(Cl)cccc2Cl)no1
Show InChI InChI=1S/C19H12Cl2F3N5O2S/c20-13-2-1-3-14(21)17(13)30-8-15-26-16(31-28-15)9-32-18-27-25-10-29(18)12-6-4-11(5-7-12)19(22,23)24/h1-7,10H,8-9H2
n/an/a 6.30E+3n/an/an/an/an/an/a
Universit£ di Pisa
Curated by ChEMBL
Assay Description
Inhibition of human recombinant EGFR
J Med Chem 52: 964-75 (2009)
Article DOI: 10.1021/jm800829v
BindingDB Entry DOI: 10.7270/Q27W6C7Q