BDBM50292877 (1R)-1-Phosphono-4-(3-phenoxyphenyl)butylsulfonic Acid Tripotassium Salt::CHEMBL462651
SMILES: [O-]P([O-])(=O)[C@@H](CCCc1cccc(Oc2ccccc2)c1)S([O-])(=O)=O
InChI Key: InChIKey=RCGCZPXSRLLKCK-MRXNPFEDSA-K
Data: 2 IC50
Activity Spreadsheet -- Enzyme Inhibition Constant Data from BindingDB
Found 2 hits for monomerid = 50292877
Trg + Lig
Ki
nM
ΔG°
kcal/mole
IC50
nM
Kd
nM
EC50/IC50
nM
koff
s-1
kon
M-1s-1
pHTemp
°C
Squalene synthetase
(Homo sapiens (Human))
BDBM50292877
((1R)-1-Phosphono-4-(3-phenoxyphenyl)butylsulfonic ...)
Show SMILES [O-]P([O-])(=O)[C@@H](CCCc1cccc(Oc2ccccc2)c1)S([O-])(=O)=O |r|
Show InChI InChI=1S/C16H19O7PS/c17-24(18,19)16(25(20,21)22)11-5-7-13-6-4-10-15(12-13)23-14-8-2-1-3-9-14/h1-4,6,8-10,12,16H,5,7,11H2,(H2,17,18,19)(H,20,21,22)/p-3/t16-/m1/s1
Reactome pathway
n/an/a 1.90E+3n/an/an/an/an/an/a
University of Illinois at Urbana-Champaign
Curated by ChEMBL
Assay Description
Inhibition of human recombinant squalene synthase expressed in Escherichia coli BL21 (DE3) cells assessed as formation of 1,10-dioic acid metabolite ...
J Med Chem 52: 976-88 (2009)
Article DOI: 10.1021/jm801023u
BindingDB Entry DOI: 10.7270/Q2VM4C87
Dehydrosqualene synthase
(Staphylococcus aureus)
BDBM50292877
((1R)-1-Phosphono-4-(3-phenoxyphenyl)butylsulfonic ...)
Show SMILES [O-]P([O-])(=O)[C@@H](CCCc1cccc(Oc2ccccc2)c1)S([O-])(=O)=O |r|
Show InChI InChI=1S/C16H19O7PS/c17-24(18,19)16(25(20,21)22)11-5-7-13-6-4-10-15(12-13)23-14-8-2-1-3-9-14/h1-4,6,8-10,12,16H,5,7,11H2,(H2,17,18,19)(H,20,21,22)/p-3/t16-/m1/s1
n/an/a 4.79E+4n/an/an/an/an/an/a
University of Illinois at Urbana-Champaign
Curated by ChEMBL
Assay Description
Inhibition of Staphylococcus aureus dehydrosqualene synthase expressed in Escherichia coli BL21 (DE3) cells by continuous spectrophotometric assay
J Med Chem 52: 976-88 (2009)
Article DOI: 10.1021/jm801023u
BindingDB Entry DOI: 10.7270/Q2VM4C87