BDBM50292981 CHEMBL489094::N-(4-Fluorophenyl)-1-[(4-([(3S)-3-methyl-1-piperazinyl]methyl)phenyl)acetyl]-4-piperidinamine
SMILES: C[C@H]1CN(Cc2ccc(CC(=O)N3CCC(CC3)Nc3ccc(F)cc3)cc2)CCN1
InChI Key: InChIKey=ABKBSWVRNXDREE-IBGZPJMESA-N
Data: 2 IC50  1 EC50
Activity Spreadsheet -- Enzyme Inhibition Constant Data from BindingDB
Found 3 hits for monomerid = 50292981
Trg + Lig
Ki
nM
ΔG°
kcal/mole
IC50
nM
Kd
nM
EC50/IC50
nM
koff
s-1
kon
M-1s-1
pHTemp
°C
Cytochrome P450 3A4
(Homo sapiens (Human))
BDBM50292981
(CHEMBL489094 | N-(4-Fluorophenyl)-1-[(4-([(3S)-3-m...)
Show SMILES C[C@H]1CN(Cc2ccc(CC(=O)N3CCC(CC3)Nc3ccc(F)cc3)cc2)CCN1 |r|
Show InChI InChI=1S/C25H33FN4O/c1-19-17-29(15-12-27-19)18-21-4-2-20(3-5-21)16-25(31)30-13-10-24(11-14-30)28-23-8-6-22(26)7-9-23/h2-9,19,24,27-28H,10-18H2,1H3/t19-/m0/s1
Reactome pathway
n/an/a 4.90E+3n/an/an/an/an/an/a
GlaxoSmithKline
Curated by ChEMBL
Assay Description
Inhibition of human CYP3A4 expressed in Escherichia coli using diethoxyfluorescein substrate by time dependent inhibition assay
J Med Chem 52: 1180-9 (2009)
Article DOI: 10.1021/jm801332q
BindingDB Entry DOI: 10.7270/Q208666T
Motilin receptor
(Homo sapiens (Human))
BDBM50292981
(CHEMBL489094 | N-(4-Fluorophenyl)-1-[(4-([(3S)-3-m...)
Show SMILES C[C@H]1CN(Cc2ccc(CC(=O)N3CCC(CC3)Nc3ccc(F)cc3)cc2)CCN1 |r|
Show InChI InChI=1S/C25H33FN4O/c1-19-17-29(15-12-27-19)18-21-4-2-20(3-5-21)16-25(31)30-13-10-24(11-14-30)28-23-8-6-22(26)7-9-23/h2-9,19,24,27-28H,10-18H2,1H3/t19-/m0/s1
Reactome pathway
n/an/an/an/a 10n/an/an/an/a
GlaxoSmithKline
Curated by ChEMBL
Assay Description
Agonist activity at human recombinant motilin receptor expressed in CHO cells assessed as increase in intracellular calcium by FLIPR assay
J Med Chem 52: 1180-9 (2009)
Article DOI: 10.1021/jm801332q
BindingDB Entry DOI: 10.7270/Q208666T
Cytochrome P450 3A4
(Homo sapiens (Human))
BDBM50292981
(CHEMBL489094 | N-(4-Fluorophenyl)-1-[(4-([(3S)-3-m...)
Show SMILES C[C@H]1CN(Cc2ccc(CC(=O)N3CCC(CC3)Nc3ccc(F)cc3)cc2)CCN1 |r|
Show InChI InChI=1S/C25H33FN4O/c1-19-17-29(15-12-27-19)18-21-4-2-20(3-5-21)16-25(31)30-13-10-24(11-14-30)28-23-8-6-22(26)7-9-23/h2-9,19,24,27-28H,10-18H2,1H3/t19-/m0/s1
Reactome pathway
n/an/a 1.40E+4n/an/an/an/an/an/a
GlaxoSmithKline
Curated by ChEMBL
Assay Description
Inhibition of human CYP3A4 expressed in Escherichia coli using 7BQ substrate by time dependent inhibition assay
J Med Chem 52: 1180-9 (2009)
Article DOI: 10.1021/jm801332q
BindingDB Entry DOI: 10.7270/Q208666T