null
SMILES: CC(C(=O)N1CCC(CC1)Nc1ccc(F)cc1)c1ccc(CN2C[C@H](C)N[C@H](C)C2)cc1
InChI Key: InChIKey=DSMHXHKJIOOKIY-WCRBZPEASA-N
Activity Spreadsheet -- Enzyme Inhibition Constant Data from BindingDB
Found 2 hits for monomerid = 50292983
Trg + Lig
Ki
nM
ΔG°
kcal/mole
IC50
nM
Kd
nM
EC50/IC50
nM
koff
s-1
kon
M-1s-1
pHTemp
°C
Motilin receptor
(Homo sapiens (Human))
BDBM50292983
(1-[2-(4-([(3R,5S)-3,5-Dimethyl-1-piperazinyl]methy...)
Show SMILES CC(C(=O)N1CCC(CC1)Nc1ccc(F)cc1)c1ccc(CN2C[C@H](C)N[C@H](C)C2)cc1 |r|
Show InChI InChI=1S/C27H37FN4O/c1-19-16-31(17-20(2)29-19)18-22-4-6-23(7-5-22)21(3)27(33)32-14-12-26(13-15-32)30-25-10-8-24(28)9-11-25/h4-11,19-21,26,29-30H,12-18H2,1-3H3/t19-,20+,21?
Reactome pathway
n/an/an/an/a 31.6n/an/an/an/a
GlaxoSmithKline
Curated by ChEMBL
Assay Description
Agonist activity at human recombinant motilin receptor expressed in CHO cells assessed as increase in intracellular calcium by FLIPR assay
J Med Chem 52: 1180-9 (2009)
Article DOI: 10.1021/jm801332q
BindingDB Entry DOI: 10.7270/Q208666T
Cytochrome P450 3A4
(Homo sapiens (Human))
BDBM50292983
(1-[2-(4-([(3R,5S)-3,5-Dimethyl-1-piperazinyl]methy...)
Show SMILES CC(C(=O)N1CCC(CC1)Nc1ccc(F)cc1)c1ccc(CN2C[C@H](C)N[C@H](C)C2)cc1 |r|
Show InChI InChI=1S/C27H37FN4O/c1-19-16-31(17-20(2)29-19)18-22-4-6-23(7-5-22)21(3)27(33)32-14-12-26(13-15-32)30-25-10-8-24(28)9-11-25/h4-11,19-21,26,29-30H,12-18H2,1-3H3/t19-,20+,21?
Reactome pathway
n/an/a 8.70E+3n/an/an/an/an/an/a
GlaxoSmithKline
Curated by ChEMBL
Assay Description
Inhibition of human CYP3A4 expressed in Escherichia coli using diethoxyfluorescein substrate by time dependent inhibition assay
J Med Chem 52: 1180-9 (2009)
Article DOI: 10.1021/jm801332q
BindingDB Entry DOI: 10.7270/Q208666T