BDBM50293070 7-({[3-Hydroxy-2-(hydroxymethyl)propyl](methyl)amino}methyl)-3,5-dihydro-4H-pyrrolo[3,2-d]pyrimidin-4-one::CHEMBL490282
SMILES: CN(CC(CO)CO)Cc1c[nH]c2c1nc[nH]c2=O
InChI Key: InChIKey=AOFDJZQAOKXDRB-UHFFFAOYSA-N
Data: 1 KI  2 Kd
Activity Spreadsheet -- Enzyme Inhibition Constant Data from BindingDB
Found 3 hits for monomerid = 50293070
Trg + Lig
Ki
nM
ΔG°
kcal/mole
IC50
nM
Kd
nM
EC50/IC50
nM
koff
s-1
kon
M-1s-1
pHTemp
°C
Purine nucleoside phosphorylase
(Homo sapiens (Human))
BDBM50293070
(7-({[3-Hydroxy-2-(hydroxymethyl)propyl](methyl)ami...)
Show SMILES CN(CC(CO)CO)Cc1c[nH]c2c1nc[nH]c2=O
Show InChI InChI=1S/C12H18N4O3/c1-16(3-8(5-17)6-18)4-9-2-13-11-10(9)14-7-15-12(11)19/h2,7-8,13,17-18H,3-6H2,1H3,(H,14,15,19)
Reactome pathway
3.70E+3n/an/an/an/an/an/an/an/a
Industrial Research Limited
Curated by ChEMBL
Assay Description
Inhibition of human PNP by xanthine-oxidase coupled assay
J Med Chem 52: 1126-43 (2009)
Article DOI: 10.1021/jm801421q
BindingDB Entry DOI: 10.7270/Q2QR4Z18
Purine nucleoside phosphorylase
(Homo sapiens (Human))
BDBM50293070
(7-({[3-Hydroxy-2-(hydroxymethyl)propyl](methyl)ami...)
Show SMILES CN(CC(CO)CO)Cc1c[nH]c2c1nc[nH]c2=O
Show InChI InChI=1S/C12H18N4O3/c1-16(3-8(5-17)6-18)4-9-2-13-11-10(9)14-7-15-12(11)19/h2,7-8,13,17-18H,3-6H2,1H3,(H,14,15,19)
Reactome pathway
US Patent
n/an/an/a 3.70n/an/an/an/a25
Industrial Research Limited; Albert Einstein College of Medicine of Yeshiva University
US Patent
Assay Description
The inhibitor dissociation constants reported in Table 1 below are for phosphorolysis of inosine by PNP and were based on reaction rates measurements...
US Patent US8853224 (2014)
BindingDB Entry DOI: 10.7270/Q27H1H84
Purine Nucleoside Phosphorylase (PNP)
(Plasmodium falciparum)
BDBM50293070
(7-({[3-Hydroxy-2-(hydroxymethyl)propyl](methyl)ami...)
Show SMILES CN(CC(CO)CO)Cc1c[nH]c2c1nc[nH]c2=O
Show InChI InChI=1S/C12H18N4O3/c1-16(3-8(5-17)6-18)4-9-2-13-11-10(9)14-7-15-12(11)19/h2,7-8,13,17-18H,3-6H2,1H3,(H,14,15,19)
US Patent
n/an/an/a 2.00E+3n/an/an/an/a25
Industrial Research Limited; Albert Einstein College of Medicine of Yeshiva University
US Patent
Assay Description
The inhibitor dissociation constants reported in Table 1 below are for phosphorolysis of inosine by PNP and were based on reaction rates measurements...
US Patent US8853224 (2014)
BindingDB Entry DOI: 10.7270/Q27H1H84