BDBM50293072 7-({[(2R,3R)-1,3,4-Trihydroxybutan-2-yl]amino}methyl)-3,5-dihydro-4H-pyrrolo[3,2-d]pyrimidin-4-one::CHEMBL522278
SMILES: OC[C@H](O)[C@@H](CO)NCc1c[nH]c2c1nc[nH]c2=O
InChI Key: InChIKey=CGYSFECPLYEOMH-SFYZADRCSA-N
Data: 1 KI  2 Kd
Activity Spreadsheet -- Enzyme Inhibition Constant Data from BindingDB
Found 3 hits for monomerid = 50293072
Trg + Lig
Ki
nM
ΔG°
kcal/mole
IC50
nM
Kd
nM
EC50/IC50
nM
koff
s-1
kon
M-1s-1
pHTemp
°C
Purine nucleoside phosphorylase
(Homo sapiens (Human))
BDBM50293072
(7-({[(2R,3R)-1,3,4-Trihydroxybutan-2-yl]amino}meth...)
Show SMILES OC[C@H](O)[C@@H](CO)NCc1c[nH]c2c1nc[nH]c2=O |r|
Show InChI InChI=1S/C11H16N4O4/c16-3-7(8(18)4-17)12-1-6-2-13-10-9(6)14-5-15-11(10)19/h2,5,7-8,12-13,16-18H,1,3-4H2,(H,14,15,19)/t7-,8+/m1/s1
Reactome pathway
4.30E+3n/an/an/an/an/an/an/an/a
Industrial Research Limited
Curated by ChEMBL
Assay Description
Inhibition of human PNP by xanthine-oxidase coupled assay
J Med Chem 52: 1126-43 (2009)
Article DOI: 10.1021/jm801421q
BindingDB Entry DOI: 10.7270/Q2QR4Z18
Purine nucleoside phosphorylase
(Homo sapiens (Human))
BDBM50293072
(7-({[(2R,3R)-1,3,4-Trihydroxybutan-2-yl]amino}meth...)
Show SMILES OC[C@H](O)[C@@H](CO)NCc1c[nH]c2c1nc[nH]c2=O |r|
Show InChI InChI=1S/C11H16N4O4/c16-3-7(8(18)4-17)12-1-6-2-13-10-9(6)14-5-15-11(10)19/h2,5,7-8,12-13,16-18H,1,3-4H2,(H,14,15,19)/t7-,8+/m1/s1
Reactome pathway
US Patent
n/an/an/a 4.30n/an/an/an/a25
Industrial Research Limited; Albert Einstein College of Medicine of Yeshiva University
US Patent
Assay Description
The inhibitor dissociation constants reported in Table 1 below are for phosphorolysis of inosine by PNP and were based on reaction rates measurements...
US Patent US8853224 (2014)
BindingDB Entry DOI: 10.7270/Q27H1H84
Purine nucleoside phosphorylase
(Plasmodium falciparum)
BDBM50293072
(7-({[(2R,3R)-1,3,4-Trihydroxybutan-2-yl]amino}meth...)
Show SMILES OC[C@H](O)[C@@H](CO)NCc1c[nH]c2c1nc[nH]c2=O |r|
Show InChI InChI=1S/C11H16N4O4/c16-3-7(8(18)4-17)12-1-6-2-13-10-9(6)14-5-15-11(10)19/h2,5,7-8,12-13,16-18H,1,3-4H2,(H,14,15,19)/t7-,8+/m1/s1
US Patent
n/an/an/a 770n/an/an/an/a25
Industrial Research Limited; Albert Einstein College of Medicine of Yeshiva University
US Patent
Assay Description
The inhibitor dissociation constants reported in Table 1 below are for phosphorolysis of inosine by PNP and were based on reaction rates measurements...
US Patent US8853224 (2014)
BindingDB Entry DOI: 10.7270/Q27H1H84