null
SMILES: OCC(O)C(CO)CNCc1c[nH]c2c1nc[nH]c2=O
InChI Key: InChIKey=MXMZHPBJYLDKFX-UHFFFAOYSA-N
Activity Spreadsheet -- Enzyme Inhibition Constant Data from BindingDB
Found 3 hits for monomerid = 50293085
Trg + Lig
Ki
nM
ΔG°
kcal/mole
IC50
nM
Kd
nM
EC50/IC50
nM
koff
s-1
kon
M-1s-1
pHTemp
°C
Purine nucleoside phosphorylase
(Homo sapiens (Human))
BDBM50293085
(7-({[(2R/S,3S/R)-3,4-Dihydroxy-2-(hydroxymethyl)bu...)
Show SMILES OCC(O)C(CO)CNCc1c[nH]c2c1nc[nH]c2=O
Show InChI InChI=1S/C12H18N4O4/c17-4-8(9(19)5-18)2-13-1-7-3-14-11-10(7)15-6-16-12(11)20/h3,6,8-9,13-14,17-19H,1-2,4-5H2,(H,15,16,20)
Reactome pathway
9.00E+5n/an/an/an/an/an/an/an/a
Industrial Research Limited
Curated by ChEMBL
Assay Description
Inhibition of human PNP by xanthine-oxidase coupled assay
J Med Chem 52: 1126-43 (2009)
Article DOI: 10.1021/jm801421q
BindingDB Entry DOI: 10.7270/Q2QR4Z18
Purine nucleoside phosphorylase
(Homo sapiens (Human))
BDBM50293085
(7-({[(2R/S,3S/R)-3,4-Dihydroxy-2-(hydroxymethyl)bu...)
Show SMILES OCC(O)C(CO)CNCc1c[nH]c2c1nc[nH]c2=O
Show InChI InChI=1S/C12H18N4O4/c17-4-8(9(19)5-18)2-13-1-7-3-14-11-10(7)15-6-16-12(11)20/h3,6,8-9,13-14,17-19H,1-2,4-5H2,(H,15,16,20)
Reactome pathway
US Patent
n/an/an/a 0.780n/an/an/an/a25
Industrial Research Limited; Albert Einstein College of Medicine of Yeshiva University
US Patent
Assay Description
The inhibitor dissociation constants reported in Table 1 below are for phosphorolysis of inosine by PNP and were based on reaction rates measurements...
US Patent US8853224 (2014)
BindingDB Entry DOI: 10.7270/Q27H1H84
Purine nucleoside phosphorylase
(Plasmodium falciparum)
BDBM50293085
(7-({[(2R/S,3S/R)-3,4-Dihydroxy-2-(hydroxymethyl)bu...)
Show SMILES OCC(O)C(CO)CNCc1c[nH]c2c1nc[nH]c2=O
Show InChI InChI=1S/C12H18N4O4/c17-4-8(9(19)5-18)2-13-1-7-3-14-11-10(7)15-6-16-12(11)20/h3,6,8-9,13-14,17-19H,1-2,4-5H2,(H,15,16,20)
US Patent
n/an/an/a 2.20E+3n/an/an/an/a25
Industrial Research Limited; Albert Einstein College of Medicine of Yeshiva University
US Patent
Assay Description
The inhibitor dissociation constants reported in Table 1 below are for phosphorolysis of inosine by PNP and were based on reaction rates measurements...
US Patent US8853224 (2014)
BindingDB Entry DOI: 10.7270/Q27H1H84