BDBM50293110 2-(4-Fluorophenyl)-6-methoxybenzo[d]thiazole::6-Methoxy-2-(4'-fluorophenyl)-1,3-benzothiazole::CHEMBL490083
SMILES: COc1ccc2nc(sc2c1)-c1ccc(F)cc1
InChI Key: InChIKey=FFMONRZWRJLZNE-UHFFFAOYSA-N
Data: 1 KI  3 IC50
Activity Spreadsheet -- Enzyme Inhibition Constant Data from BindingDB
Found 4 hits for monomerid = 50293110
Trg + Lig
Ki
nM
ΔG°
kcal/mole
IC50
nM
Kd
nM
EC50/IC50
nM
koff
s-1
kon
M-1s-1
pHTemp
°C
Beta amyloid A4 protein
(Homo sapiens (Human))
BDBM50293110
(2-(4-Fluorophenyl)-6-methoxybenzo[d]thiazole | 6-M...)
Show SMILES COc1ccc2nc(sc2c1)-c1ccc(F)cc1
Show InChI InChI=1S/C14H10FNOS/c1-17-11-6-7-12-13(8-11)18-14(16-12)9-2-4-10(15)5-3-9/h2-8H,1H3
Reactome pathway
2.20n/an/an/an/an/an/an/an/a
Katholieke Universiteit Leuven
Curated by ChEMBL
Assay Description
Displacement of [125I]IMPY from beta-amyloid plaques in Alzheimer's disease patient brain homogenate
J Med Chem 52: 1428-37 (2009)
Article DOI: 10.1021/jm8013376
BindingDB Entry DOI: 10.7270/Q2028VCM
Luciferin 4-monooxygenase
(Photinus pyralis)
BDBM50293110
(2-(4-Fluorophenyl)-6-methoxybenzo[d]thiazole | 6-M...)
Show SMILES COc1ccc2nc(sc2c1)-c1ccc(F)cc1
Show InChI InChI=1S/C14H10FNOS/c1-17-11-6-7-12-13(8-11)18-14(16-12)9-2-4-10(15)5-3-9/h2-8H,1H3
n/an/a 1.30E+3n/an/an/an/an/an/a
National Institutes of Health
Curated by ChEMBL
Assay Description
Inhibition of luciferin binding site of Photinus pyralis luciferase by competitive inhibition assay
J Med Chem 52: 1450-8 (2010)
Article DOI: 10.1021/jm8014525
BindingDB Entry DOI: 10.7270/Q2XD11PW
3D
3D Structure (docked)
Luciferin 4-monooxygenase
(Photuris pennsylvanica)
BDBM50293110
(2-(4-Fluorophenyl)-6-methoxybenzo[d]thiazole | 6-M...)
Show SMILES COc1ccc2nc(sc2c1)-c1ccc(F)cc1
Show InChI InChI=1S/C14H10FNOS/c1-17-11-6-7-12-13(8-11)18-14(16-12)9-2-4-10(15)5-3-9/h2-8H,1H3
n/an/a>5.00E+4n/an/an/an/an/an/a
National Institutes of Health
Curated by ChEMBL
Assay Description
Inhibition of luciferin binding site of Photuris pennsylvanica luciferase by competitive KinaseGlo luminescent assay
J Med Chem 52: 1450-8 (2010)
Article DOI: 10.1021/jm8014525
BindingDB Entry DOI: 10.7270/Q2XD11PW
Luciferin 4-monooxygenase
(Photuris pennsylvanica)
BDBM50293110
(2-(4-Fluorophenyl)-6-methoxybenzo[d]thiazole | 6-M...)
Show SMILES COc1ccc2nc(sc2c1)-c1ccc(F)cc1
Show InChI InChI=1S/C14H10FNOS/c1-17-11-6-7-12-13(8-11)18-14(16-12)9-2-4-10(15)5-3-9/h2-8H,1H3
n/an/a 860n/an/an/an/an/an/a
National Institutes of Health
Curated by ChEMBL
Assay Description
Inhibition of luciferin binding site of Photuris pennsylvanica luciferase by competitive inhibition assay
J Med Chem 52: 1450-8 (2010)
Article DOI: 10.1021/jm8014525
BindingDB Entry DOI: 10.7270/Q2XD11PW