BDBM50293118 6-Methoxy-2-(4-methoxyphenyl)benzo[d]thiazole::CHEMBL511869
SMILES: COc1ccc(cc1)-c1nc2ccc(OC)cc2s1
InChI Key: InChIKey=IJPKHBPIYXFMJD-UHFFFAOYSA-N
Data: 3 IC50
Activity Spreadsheet -- Enzyme Inhibition Constant Data from BindingDB
Found 3 hits for monomerid = 50293118
Trg + Lig
Ki
nM
ΔG°
kcal/mole
IC50
nM
Kd
nM
EC50/IC50
nM
koff
s-1
kon
M-1s-1
pHTemp
°C
Luciferin 4-monooxygenase
(Photuris pennsylvanica)
BDBM50293118
(6-Methoxy-2-(4-methoxyphenyl)benzo[d]thiazole | CH...)
Show SMILES COc1ccc(cc1)-c1nc2ccc(OC)cc2s1
Show InChI InChI=1S/C15H13NO2S/c1-17-11-5-3-10(4-6-11)15-16-13-8-7-12(18-2)9-14(13)19-15/h3-9H,1-2H3
n/an/a 4.10E+3n/an/an/an/an/an/a
National Institutes of Health
Curated by ChEMBL
Assay Description
Inhibition of luciferin binding site of Photuris pennsylvanica luciferase by competitive inhibition assay
J Med Chem 52: 1450-8 (2010)
Article DOI: 10.1021/jm8014525
BindingDB Entry DOI: 10.7270/Q2XD11PW
Luciferin 4-monooxygenase
(Photuris pennsylvanica)
BDBM50293118
(6-Methoxy-2-(4-methoxyphenyl)benzo[d]thiazole | CH...)
Show SMILES COc1ccc(cc1)-c1nc2ccc(OC)cc2s1
Show InChI InChI=1S/C15H13NO2S/c1-17-11-5-3-10(4-6-11)15-16-13-8-7-12(18-2)9-14(13)19-15/h3-9H,1-2H3
n/an/a>5.00E+4n/an/an/an/an/an/a
National Institutes of Health
Curated by ChEMBL
Assay Description
Inhibition of luciferin binding site of Photuris pennsylvanica luciferase by competitive KinaseGlo luminescent assay
J Med Chem 52: 1450-8 (2010)
Article DOI: 10.1021/jm8014525
BindingDB Entry DOI: 10.7270/Q2XD11PW
Luciferin 4-monooxygenase
(Photinus pyralis)
BDBM50293118
(6-Methoxy-2-(4-methoxyphenyl)benzo[d]thiazole | CH...)
Show SMILES COc1ccc(cc1)-c1nc2ccc(OC)cc2s1
Show InChI InChI=1S/C15H13NO2S/c1-17-11-5-3-10(4-6-11)15-16-13-8-7-12(18-2)9-14(13)19-15/h3-9H,1-2H3
n/an/a 2.20E+3n/an/an/an/an/an/a
National Institutes of Health
Curated by ChEMBL
Assay Description
Inhibition of luciferin binding site of Photinus pyralis luciferase by competitive inhibition assay
J Med Chem 52: 1450-8 (2010)
Article DOI: 10.1021/jm8014525
BindingDB Entry DOI: 10.7270/Q2XD11PW
3D
3D Structure (docked)