BDBM50293201 (R)-4-cyclopentyl-2-((4-(morpholinomethyl)phenoxy)methyl)morpholine::CHEMBL524088
SMILES: C(Oc1ccc(CN2CCOCC2)cc1)[C@H]1CN(CCO1)C1CCCC1
InChI Key: InChIKey=CCLHRWBVZOMXEV-OAQYLSRUSA-N
Data: 2 KI  1 Kd
Activity Spreadsheet -- Enzyme Inhibition Constant Data from BindingDB
Found 3 hits for monomerid = 50293201
Trg + Lig
Ki
nM
ΔG°
kcal/mole
IC50
nM
Kd
nM
EC50/IC50
nM
koff
s-1
kon
M-1s-1
pHTemp
°C
Histamine H3 receptor
(Homo sapiens (Human))
BDBM50293201
((R)-4-cyclopentyl-2-((4-(morpholinomethyl)phenoxy)...)
Show SMILES C(Oc1ccc(CN2CCOCC2)cc1)[C@H]1CN(CCO1)C1CCCC1 |r|
Show InChI InChI=1S/C21H32N2O3/c1-2-4-19(3-1)23-11-14-25-21(16-23)17-26-20-7-5-18(6-8-20)15-22-9-12-24-13-10-22/h5-8,19,21H,1-4,9-17H2/t21-/m1/s1
Reactome pathway
31n/an/an/an/an/an/an/an/a
Johnson& Johnson Pharmaceutical Research& Development L.L.C.
Curated by ChEMBL
Assay Description
Displacement of [125I]iodoproxyfan from human recombinant histamine H3 receptor expressed in human SK-N-MC cells
Bioorg Med Chem Lett 18: 5796-9 (2009)
Article DOI: 10.1016/j.bmcl.2008.09.077
BindingDB Entry DOI: 10.7270/Q2154H28
Histamine H3 receptor
(Rattus norvegicus (rat))
BDBM50293201
((R)-4-cyclopentyl-2-((4-(morpholinomethyl)phenoxy)...)
Show SMILES C(Oc1ccc(CN2CCOCC2)cc1)[C@H]1CN(CCO1)C1CCCC1 |r|
Show InChI InChI=1S/C21H32N2O3/c1-2-4-19(3-1)23-11-14-25-21(16-23)17-26-20-7-5-18(6-8-20)15-22-9-12-24-13-10-22/h5-8,19,21H,1-4,9-17H2/t21-/m1/s1
Reactome pathway
121n/an/an/an/an/an/an/an/a
Johnson& Johnson Pharmaceutical Research& Development L.L.C.
Curated by ChEMBL
Assay Description
Displacement of [125I]iodoproxyfan from rat recombinant histamine H3 receptor expressed in human SK-N-MC cells
Bioorg Med Chem Lett 18: 5796-9 (2009)
Article DOI: 10.1016/j.bmcl.2008.09.077
BindingDB Entry DOI: 10.7270/Q2154H28
Histamine H3 receptor
(Rattus norvegicus (rat))
BDBM50293201
((R)-4-cyclopentyl-2-((4-(morpholinomethyl)phenoxy)...)
Show SMILES C(Oc1ccc(CN2CCOCC2)cc1)[C@H]1CN(CCO1)C1CCCC1 |r|
Show InChI InChI=1S/C21H32N2O3/c1-2-4-19(3-1)23-11-14-25-21(16-23)17-26-20-7-5-18(6-8-20)15-22-9-12-24-13-10-22/h5-8,19,21H,1-4,9-17H2/t21-/m1/s1
Reactome pathway
n/an/an/a 43.6n/an/an/an/an/a
Johnson& Johnson Pharmaceutical Research& Development L.L.C.
Curated by ChEMBL
Assay Description
Antagonist activity rat recombinant histamine H3 receptor expressed in human SK-N-MC cells
Bioorg Med Chem Lett 18: 5796-9 (2009)
Article DOI: 10.1016/j.bmcl.2008.09.077
BindingDB Entry DOI: 10.7270/Q2154H28