null
SMILES: ONC(=O)\C=C\c1cccc(c1)-c1ccc(O)cc1
InChI Key: InChIKey=PEUKSPCAHSCJAC-RUDMXATFSA-N
Activity Spreadsheet -- Enzyme Inhibition Constant Data from BindingDB
Found 2 hits for monomerid = 50293354
Trg + Lig
Ki
nM
ΔG°
kcal/mole
IC50
nM
Kd
nM
EC50/IC50
nM
koff
s-1
kon
M-1s-1
pHTemp
°C
Histone deacetylase 8
(Homo sapiens (Human))
BDBM50293354
(CHEMBL555906 | N-hydroxy-E-3-[4'-Hydroxybiphenyl-3...)
Show SMILES ONC(=O)\C=C\c1cccc(c1)-c1ccc(O)cc1
Show InChI InChI=1S/C15H13NO3/c17-14-7-5-12(6-8-14)13-3-1-2-11(10-13)4-9-15(18)16-19/h1-10,17,19H,(H,16,18)/b9-4+
NCI pathway
Reactome pathway
n/an/a 320n/an/an/an/an/an/a
TBA
Assay Description
Inhibition of Homo sapiens (human) HDAC8
Citation and Details
Article DOI: 10.1007/s00044-011-9571-y
BindingDB Entry DOI: 10.7270/Q2KH0R79
Histone deacetylase 2
(Homo sapiens (Human))
BDBM50293354
(CHEMBL555906 | N-hydroxy-E-3-[4'-Hydroxybiphenyl-3...)
Show SMILES ONC(=O)\C=C\c1cccc(c1)-c1ccc(O)cc1
Show InChI InChI=1S/C15H13NO3/c17-14-7-5-12(6-8-14)13-3-1-2-11(10-13)4-9-15(18)16-19/h1-10,17,19H,(H,16,18)/b9-4+
NCI pathway
Reactome pathway
n/an/a 320n/an/an/an/an/an/a
Universit£ di Milano
Curated by ChEMBL
Assay Description
Inhibition of HDAC2 in human HeLa cells
Eur J Med Chem 44: 1900-12 (2009)
Article DOI: 10.1016/j.ejmech.2008.11.005
BindingDB Entry DOI: 10.7270/Q2M045G2