null
SMILES: ONC(=O)\C=C\c1ccc(cc1)-c1ccc(Cl)cc1
InChI Key: InChIKey=GBZPSEMNRBQROD-XCVCLJGOSA-N
Activity Spreadsheet -- Enzyme Inhibition Constant Data from BindingDB
Found 1 hit for monomerid = 50293365
Trg + Lig
Ki
nM
ΔG°
kcal/mole
IC50
nM
Kd
nM
EC50/IC50
nM
koff
s-1
kon
M-1s-1
pHTemp
°C
Histone deacetylase 2
(Homo sapiens (Human))
BDBM50293365
(CHEMBL557066 | N-Hydroxy-E-3-(4'-chlorobiphenyl-4-...)
Show SMILES ONC(=O)\C=C\c1ccc(cc1)-c1ccc(Cl)cc1
Show InChI InChI=1S/C15H12ClNO2/c16-14-8-6-13(7-9-14)12-4-1-11(2-5-12)3-10-15(18)17-19/h1-10,19H,(H,17,18)/b10-3+
NCI pathway
Reactome pathway
n/an/a 1.86E+3n/an/an/an/an/an/a
Universit£ di Milano
Curated by ChEMBL
Assay Description
Inhibition of HDAC2 in human HeLa cells
Eur J Med Chem 44: 1900-12 (2009)
Article DOI: 10.1016/j.ejmech.2008.11.005
BindingDB Entry DOI: 10.7270/Q2M045G2