BDBM50293386 CHEMBL554824::{(3S)-5-[2-({4-[Amino(imino)methyl]benzyl}amino)-2-oxoethyl]-3-[benzylsulfonylamino]-4-oxo-2,3,4,5-tetrahydro-1,5-benzothiazepin-7-yl}-propanoic acid, trifluoroacetate
SMILES: NC(=N)c1ccc(CNC(=O)CN2c3cc(CCC(O)=O)ccc3SC[C@@H](NS(=O)(=O)Cc3ccccc3)C2=O)cc1
InChI Key: InChIKey=QRFLSLZVPXHHCL-HSZRJFAPSA-N
Data: 3 IC50
Activity Spreadsheet -- Enzyme Inhibition Constant Data from BindingDB
Found 3 hits for monomerid = 50293386
Trg + Lig
Ki
nM
ΔG°
kcal/mole
IC50
nM
Kd
nM
EC50/IC50
nM
koff
s-1
kon
M-1s-1
pHTemp
°C
Prothrombin
(Homo sapiens (Human))
BDBM50293386
(CHEMBL554824 | {(3S)-5-[2-({4-[Amino(imino)methyl]...)
Show SMILES NC(=N)c1ccc(CNC(=O)CN2c3cc(CCC(O)=O)ccc3SC[C@@H](NS(=O)(=O)Cc3ccccc3)C2=O)cc1 |r|
Show InChI InChI=1S/C29H31N5O6S2/c30-28(31)22-10-6-20(7-11-22)15-32-26(35)16-34-24-14-19(9-13-27(36)37)8-12-25(24)41-17-23(29(34)38)33-42(39,40)18-21-4-2-1-3-5-21/h1-8,10-12,14,23,33H,9,13,15-18H2,(H3,30,31)(H,32,35)(H,36,37)/t23-/m1/s1
n/an/a 3.30E+4n/an/an/an/an/an/a
Universit£ Montpellier 1
Curated by ChEMBL
Assay Description
Inhibition of human factor 2a by spectrophotometry
Bioorg Med Chem Lett 19: 1386-91 (2009)
Article DOI: 10.1016/j.bmcl.2009.01.039
BindingDB Entry DOI: 10.7270/Q2G73DRB
Coagulation factor VII/tissue factor
(Homo sapiens (Human))
BDBM50293386
(CHEMBL554824 | {(3S)-5-[2-({4-[Amino(imino)methyl]...)
Show SMILES NC(=N)c1ccc(CNC(=O)CN2c3cc(CCC(O)=O)ccc3SC[C@@H](NS(=O)(=O)Cc3ccccc3)C2=O)cc1 |r|
Show InChI InChI=1S/C29H31N5O6S2/c30-28(31)22-10-6-20(7-11-22)15-32-26(35)16-34-24-14-19(9-13-27(36)37)8-12-25(24)41-17-23(29(34)38)33-42(39,40)18-21-4-2-1-3-5-21/h1-8,10-12,14,23,33H,9,13,15-18H2,(H3,30,31)(H,32,35)(H,36,37)/t23-/m1/s1
Reactome pathway
n/an/a 2.64E+3n/an/an/an/an/an/a
Universit£ Montpellier 1
Curated by ChEMBL
Assay Description
Inhibition of human tissue factor/factor 7a
Bioorg Med Chem Lett 19: 1386-91 (2009)
Article DOI: 10.1016/j.bmcl.2009.01.039
BindingDB Entry DOI: 10.7270/Q2G73DRB
Coagulation factor X
(Homo sapiens (Human))
BDBM50293386
(CHEMBL554824 | {(3S)-5-[2-({4-[Amino(imino)methyl]...)
Show SMILES NC(=N)c1ccc(CNC(=O)CN2c3cc(CCC(O)=O)ccc3SC[C@@H](NS(=O)(=O)Cc3ccccc3)C2=O)cc1 |r|
Show InChI InChI=1S/C29H31N5O6S2/c30-28(31)22-10-6-20(7-11-22)15-32-26(35)16-34-24-14-19(9-13-27(36)37)8-12-25(24)41-17-23(29(34)38)33-42(39,40)18-21-4-2-1-3-5-21/h1-8,10-12,14,23,33H,9,13,15-18H2,(H3,30,31)(H,32,35)(H,36,37)/t23-/m1/s1
Reactome pathway
n/an/a 2.03E+3n/an/an/an/an/an/a
Universit£ Montpellier 1
Curated by ChEMBL
Assay Description
Inhibition of human factor 10a by spectrometry
Bioorg Med Chem Lett 19: 1386-91 (2009)
Article DOI: 10.1016/j.bmcl.2009.01.039
BindingDB Entry DOI: 10.7270/Q2G73DRB