BDBM50293557 (R)-N[3-phenyl-3-(4'-(4-toluoyl)phenoxy)-propyl]sarcosine::CHEMBL551223
SMILES: CN(CC[C@@H](Oc1ccc(cc1)C(=O)c1ccc(C)cc1)c1ccccc1)CC(O)=O
InChI Key: InChIKey=HNBKNDFZJLEZLZ-XMMPIXPASA-N
Data: 1 KI  1 IC50
Activity Spreadsheet -- Enzyme Inhibition Constant Data from BindingDB
Found 2 hits for monomerid = 50293557
Trg + Lig
Ki
nM
ΔG°
kcal/mole
IC50
nM
Kd
nM
EC50/IC50
nM
koff
s-1
kon
M-1s-1
pHTemp
°C
Glycine transporter 1
(Homo sapiens (Human))
BDBM50293557
((R)-N[3-phenyl-3-(4'-(4-toluoyl)phenoxy)-propyl]sa...)
Show SMILES CN(CC[C@@H](Oc1ccc(cc1)C(=O)c1ccc(C)cc1)c1ccccc1)CC(O)=O |r|
Show InChI InChI=1S/C26H27NO4/c1-19-8-10-21(11-9-19)26(30)22-12-14-23(15-13-22)31-24(20-6-4-3-5-7-20)16-17-27(2)18-25(28)29/h3-15,24H,16-18H2,1-2H3,(H,28,29)/t24-/m1/s1
2.30n/an/an/an/an/an/an/an/a
Pfizer Global Research and Development
Curated by ChEMBL
Assay Description
Binding affinity to GlyT1
Bioorg Med Chem Lett 19: 2974-6 (2009)
Article DOI: 10.1016/j.bmcl.2009.04.035
BindingDB Entry DOI: 10.7270/Q2F76CKH
Glycine transporter 2
(Homo sapiens (Human))
BDBM50293557
((R)-N[3-phenyl-3-(4'-(4-toluoyl)phenoxy)-propyl]sa...)
Show SMILES CN(CC[C@@H](Oc1ccc(cc1)C(=O)c1ccc(C)cc1)c1ccccc1)CC(O)=O |r|
Show InChI InChI=1S/C26H27NO4/c1-19-8-10-21(11-9-19)26(30)22-12-14-23(15-13-22)31-24(20-6-4-3-5-7-20)16-17-27(2)18-25(28)29/h3-15,24H,16-18H2,1-2H3,(H,28,29)/t24-/m1/s1
Reactome pathway
n/an/a>1.00E+4n/an/an/an/an/an/a
Pfizer Global Research and Development
Curated by ChEMBL
Assay Description
Displacement of [3H]glycine from GlyT2
Bioorg Med Chem Lett 19: 2974-6 (2009)
Article DOI: 10.1016/j.bmcl.2009.04.035
BindingDB Entry DOI: 10.7270/Q2F76CKH