BDBM50293567 1-Methyl-1H-imidazole-4-carboxylic acid(3-aza-bicyclo[3.1.0]hex-6-ylmethyl)-(3-chloro-4-fluoro-benzyl)-amide::CHEMBL560289
SMILES: Cn1cnc(c1)C(=O)N(C[C@H]1[C@@H]2CNC[C@H]12)Cc1ccc(F)c(Cl)c1
InChI Key: InChIKey=HTUXUNBQNWREPD-WDNDVIMCSA-N
Data: 1 KI  2 IC50
Activity Spreadsheet -- Enzyme Inhibition Constant Data from BindingDB
Found 3 hits for monomerid = 50293567
Trg + Lig
Ki
nM
ΔG°
kcal/mole
IC50
nM
Kd
nM
EC50/IC50
nM
koff
s-1
kon
M-1s-1
pHTemp
°C
Glycine transporter 1
(Homo sapiens (Human))
BDBM50293567
(1-Methyl-1H-imidazole-4-carboxylic acid(3-aza-bicy...)
Show SMILES Cn1cnc(c1)C(=O)N(C[C@H]1[C@@H]2CNC[C@H]12)Cc1ccc(F)c(Cl)c1 |r|
Show InChI InChI=1S/C18H20ClFN4O/c1-23-9-17(22-10-23)18(25)24(8-14-12-5-21-6-13(12)14)7-11-2-3-16(20)15(19)4-11/h2-4,9-10,12-14,21H,5-8H2,1H3/t12-,13+,14+
109n/an/an/an/an/an/an/an/a
Pfizer Global Research and Development
Curated by ChEMBL
Assay Description
Binding affinity to GlyT1
Bioorg Med Chem Lett 19: 2974-6 (2009)
Article DOI: 10.1016/j.bmcl.2009.04.035
BindingDB Entry DOI: 10.7270/Q2F76CKH
Potassium voltage-gated channel subfamily H member 2
(Homo sapiens (Human))
BDBM50293567
(1-Methyl-1H-imidazole-4-carboxylic acid(3-aza-bicy...)
Show SMILES Cn1cnc(c1)C(=O)N(C[C@H]1[C@@H]2CNC[C@H]12)Cc1ccc(F)c(Cl)c1 |r|
Show InChI InChI=1S/C18H20ClFN4O/c1-23-9-17(22-10-23)18(25)24(8-14-12-5-21-6-13(12)14)7-11-2-3-16(20)15(19)4-11/h2-4,9-10,12-14,21H,5-8H2,1H3/t12-,13+,14+
Reactome pathway
n/an/a 1.46E+4n/an/an/an/an/an/a
Pfizer Global Research and Development
Curated by ChEMBL
Assay Description
Inhibition human ERG expressed in HEK293 cells assessed as blockade of membrane current by patch clamp method
Bioorg Med Chem Lett 19: 2974-6 (2009)
Article DOI: 10.1016/j.bmcl.2009.04.035
BindingDB Entry DOI: 10.7270/Q2F76CKH
Glycine transporter 2
(Homo sapiens (Human))
BDBM50293567
(1-Methyl-1H-imidazole-4-carboxylic acid(3-aza-bicy...)
Show SMILES Cn1cnc(c1)C(=O)N(C[C@H]1[C@@H]2CNC[C@H]12)Cc1ccc(F)c(Cl)c1 |r|
Show InChI InChI=1S/C18H20ClFN4O/c1-23-9-17(22-10-23)18(25)24(8-14-12-5-21-6-13(12)14)7-11-2-3-16(20)15(19)4-11/h2-4,9-10,12-14,21H,5-8H2,1H3/t12-,13+,14+
Reactome pathway
n/an/a>1.00E+4n/an/an/an/an/an/a
Pfizer Global Research and Development
Curated by ChEMBL
Assay Description
Displacement of [3H]glycine from GlyT2
Bioorg Med Chem Lett 19: 2974-6 (2009)
Article DOI: 10.1016/j.bmcl.2009.04.035
BindingDB Entry DOI: 10.7270/Q2F76CKH