null
SMILES: Cn1cccc1C(=O)Nc1ccc(Cl)c(Cl)c1
InChI Key: InChIKey=FQRDINXIBALEKR-UHFFFAOYSA-N
Activity Spreadsheet -- Enzyme Inhibition Constant Data from BindingDB
Found 1 hit for monomerid = 50293727
Trg + Lig
Ki
nM
ΔG°
kcal/mole
IC50
nM
Kd
nM
EC50/IC50
nM
koff
s-1
kon
M-1s-1
pHTemp
°C
Metabotropic glutamate receptor 4
(Homo sapiens (Human))
BDBM50293727
(CHEMBL552558 | N-(3,4-dichlorophenyl)-1-methyl-1H-...)
Show SMILES Cn1cccc1C(=O)Nc1ccc(Cl)c(Cl)c1
Show InChI InChI=1S/C12H10Cl2N2O/c1-16-6-2-3-11(16)12(17)15-8-4-5-9(13)10(14)7-8/h2-7H,1H3,(H,15,17)
n/an/an/an/a>1.00E+4n/an/an/an/a
Vanderbilt University Medical Center
Curated by ChEMBL
Assay Description
Activity at human mGluR4 receptor expressed in CHO cells assessed as effect on calcium mobilization
J Med Chem 52: 4115-8 (2009)
Article DOI: 10.1021/jm9005065
BindingDB Entry DOI: 10.7270/Q2RJ4JHT