null
SMILES: COc1nc(NC(=O)c2ccccn2)ccc1Cl
InChI Key: InChIKey=UYSNCZHSYFZFQK-UHFFFAOYSA-N
Activity Spreadsheet -- Enzyme Inhibition Constant Data from BindingDB
Found 1 hit for monomerid = 50293740
Trg + Lig
Ki
nM
ΔG°
kcal/mole
IC50
nM
Kd
nM
EC50/IC50
nM
koff
s-1
kon
M-1s-1
pHTemp
°C
Metabotropic glutamate receptor 4
(Homo sapiens (Human))
BDBM50293740
(CHEMBL540427 | N-(5-chloro-6-methoxypyridin-2-yl)p...)
Show SMILES COc1nc(NC(=O)c2ccccn2)ccc1Cl
Show InChI InChI=1S/C12H10ClN3O2/c1-18-12-8(13)5-6-10(16-12)15-11(17)9-4-2-3-7-14-9/h2-7H,1H3,(H,15,16,17)
n/an/an/an/a>5.00E+3n/an/an/an/a
Vanderbilt University Medical Center
Curated by ChEMBL
Assay Description
Activity at human mGluR4 receptor expressed in CHO cells assessed as effect on calcium mobilization
J Med Chem 52: 4115-8 (2009)
Article DOI: 10.1021/jm9005065
BindingDB Entry DOI: 10.7270/Q2RJ4JHT