BDBM50293818 ((2R,3S,4R,5R)-5-(2-amino-6-oxo-1,6,7,8-tetrahydropurin-9-yl)-3,4-dihydroxy-tetrahydrofuran-2-yl)methyl phosphate::CHEMBL564410
SMILES: Nc1nc2N(CNc2c(=O)[nH]1)[C@@H]1O[C@H](COP(O)(O)=O)[C@@H](O)[C@H]1O
InChI Key: InChIKey=PRELUFZXUIIWGM-UUOKFMHZSA-N
Data: 1 KI
Activity Spreadsheet -- Enzyme Inhibition Constant Data from BindingDB
Found 1 hit for monomerid = 50293818
Trg + Lig
Ki
nM
ΔG°
kcal/mole
IC50
nM
Kd
nM
EC50/IC50
nM
koff
s-1
kon
M-1s-1
pHTemp
°C
Hypoxanthine-guanine phosphoribosyltransferase (HGPRT)
(Homo sapiens (Human))
BDBM50293818
(((2R,3S,4R,5R)-5-(2-amino-6-oxo-1,6,7,8-tetrahydro...)
Show SMILES Nc1nc2N(CNc2c(=O)[nH]1)[C@@H]1O[C@H](COP(O)(O)=O)[C@@H](O)[C@H]1O |r|
Show InChI InChI=1S/C10H16N5O8P/c11-10-13-7-4(8(18)14-10)12-2-15(7)9-6(17)5(16)3(23-9)1-22-24(19,20)21/h3,5-6,9,12,16-17H,1-2H2,(H2,19,20,21)(H3,11,13,14,18)/t3-,5-,6-,9-/m1/s1
Reactome pathway
5.80E+3n/an/an/an/an/an/a7.4n/a
The University of Queensland
Curated by ChEMBL
Assay Description
Inhibition of human recombinant HGPRT at pH 7.4 by spectrophotometric assay
J Med Chem 52: 4391-9 (2009)
Article DOI: 10.1021/jm900267n
BindingDB Entry DOI: 10.7270/Q27M0809
3D
3D Structure (docked)