BDBM50293839 2-(4-fluoro-3-nitrophenylamino)-N-(4-morpholinophenyl)acetamide::CHEMBL563777
SMILES: [O-][N+](=O)c1cc(NCC(=O)Nc2ccc(cc2)N2CCOCC2)ccc1F
InChI Key: InChIKey=GSICPYQETVXLMG-UHFFFAOYSA-N
Data: 1 IC50
Activity Spreadsheet -- Enzyme Inhibition Constant Data from BindingDB
Found 1 hit for monomerid = 50293839
Trg + Lig
Ki
nM
ΔG°
kcal/mole
IC50
nM
Kd
nM
EC50/IC50
nM
koff
s-1
kon
M-1s-1
pHTemp
°C
Ras-related C3 botulinum toxin substrate 1/T-lymphoma invasion and metastasis-inducing protein 1
(Homo sapiens (Human))
BDBM50293839
(2-(4-fluoro-3-nitrophenylamino)-N-(4-morpholinophe...)
Show SMILES [O-][N+](=O)c1cc(NCC(=O)Nc2ccc(cc2)N2CCOCC2)ccc1F
Show InChI InChI=1S/C18H19FN4O4/c19-16-6-3-14(11-17(16)23(25)26)20-12-18(24)21-13-1-4-15(5-2-13)22-7-9-27-10-8-22/h1-6,11,20H,7-10,12H2,(H,21,24)
NCI pathway
Reactome pathway
n/an/a 5.72E+4n/an/an/an/an/an/a
Universit£ degli Studi di Milano
Curated by ChEMBL
Assay Description
Inhibition of PDGF-BB-stimulated Rac1 activity in human aortic smooth muscle cells assessed as reduction of Rac1GTP level after 4 hrs by G-LISA
J Med Chem 52: 4087-90 (2009)
Article DOI: 10.1021/jm8015987
BindingDB Entry DOI: 10.7270/Q23T9H81