BDBM50293858 (S)-2-(3-Benzoylphenyl)-N,N-bis(4-hydroxyphenethyl)propanamide::CHEMBL551292
SMILES: C[C@H](C(=O)N(CCc1ccc(O)cc1)CCc1ccc(O)cc1)c1cccc(c1)C(=O)c1ccccc1
InChI Key: InChIKey=RDCGSVKRGOJGBT-QHCPKHFHSA-N
Data: 2 IC50
Activity Spreadsheet -- Enzyme Inhibition Constant Data from BindingDB
Found 2 hits for monomerid = 50293858
Trg + Lig
Ki
nM
ΔG°
kcal/mole
IC50
nM
Kd
nM
EC50/IC50
nM
koff
s-1
kon
M-1s-1
pHTemp
°C
Zinc finger protein GLI2
(Homo sapiens (Human))
BDBM50293858
((S)-2-(3-Benzoylphenyl)-N,N-bis(4-hydroxyphenethyl...)
Show SMILES C[C@H](C(=O)N(CCc1ccc(O)cc1)CCc1ccc(O)cc1)c1cccc(c1)C(=O)c1ccccc1 |r|
Show InChI InChI=1S/C32H31NO4/c1-23(27-8-5-9-28(22-27)31(36)26-6-3-2-4-7-26)32(37)33(20-18-24-10-14-29(34)15-11-24)21-19-25-12-16-30(35)17-13-25/h2-17,22-23,34-35H,18-21H2,1H3/t23-/m0/s1
NCI pathway
Reactome pathway
n/an/a 2.05E+4n/an/an/an/an/an/a
St Jude Children's Research Hospital
Curated by ChEMBL
Assay Description
Inhibition of exogenously transfected human Gli2 deltaN-mediated transcriptional activity in mouse C3H10T1/2 cells after 24 hrs by luciferase reporte...
J Med Chem 52: 4277-87 (2009)
Article DOI: 10.1021/jm900106f
BindingDB Entry DOI: 10.7270/Q2QJ7H9J
Zinc finger protein GLI1
(Homo sapiens (Human))
BDBM50293858
((S)-2-(3-Benzoylphenyl)-N,N-bis(4-hydroxyphenethyl...)
Show SMILES C[C@H](C(=O)N(CCc1ccc(O)cc1)CCc1ccc(O)cc1)c1cccc(c1)C(=O)c1ccccc1 |r|
Show InChI InChI=1S/C32H31NO4/c1-23(27-8-5-9-28(22-27)31(36)26-6-3-2-4-7-26)32(37)33(20-18-24-10-14-29(34)15-11-24)21-19-25-12-16-30(35)17-13-25/h2-17,22-23,34-35H,18-21H2,1H3/t23-/m0/s1
NCI pathway
Reactome pathway
n/an/a 9.40E+3n/an/an/an/an/an/a
St Jude Children's Research Hospital
Curated by ChEMBL
Assay Description
Inhibition of exogenously transfected human Gli1-mediated transcriptional activity in mouse C3H10T1/2 cells after 24 hrs by luciferase reporter gene ...
J Med Chem 52: 4277-87 (2009)
Article DOI: 10.1021/jm900106f
BindingDB Entry DOI: 10.7270/Q2QJ7H9J