BDBM50293974 (R)-5-Chloro-1-(1-cyclopropylpropyl)-3-(4-methoxy-2,5-dimethylphenylamino)pyrazin-2(1H)-one::CHEMBL551033
SMILES: CC[C@H](C1CC1)n1cc(Cl)nc(Nc2cc(C)c(OC)cc2C)c1=O
InChI Key: InChIKey=PXQVFCROVZXJAD-OAHLLOKOSA-N
Data: 1 IC50
Activity Spreadsheet -- Enzyme Inhibition Constant Data from BindingDB
Found 1 hit for monomerid = 50293974
Trg + Lig
Ki
nM
ΔG°
kcal/mole
IC50
nM
Kd
nM
EC50/IC50
nM
koff
s-1
kon
M-1s-1
pHTemp
°C
Corticotropin releasing factor receptor
(Rattus norvegicus (rat))
BDBM50293974
((R)-5-Chloro-1-(1-cyclopropylpropyl)-3-(4-methoxy-...)
Show SMILES CC[C@H](C1CC1)n1cc(Cl)nc(Nc2cc(C)c(OC)cc2C)c1=O |r|
Show InChI InChI=1S/C19H24ClN3O2/c1-5-15(13-6-7-13)23-10-17(20)22-18(19(23)24)21-14-8-12(3)16(25-4)9-11(14)2/h8-10,13,15H,5-7H2,1-4H3,(H,21,22)/t15-/m1/s1
Reactome pathway
n/an/a 0.270n/an/an/an/an/an/a
Bristol-Myers Squibb Company
Curated by ChEMBL
Assay Description
Displacement of [125I]Tyr-ovine-CRF from CRF1 receptor in rat frontal cortex homogenate by gamma counting
J Med Chem 52: 4173-91 (2009)
Article DOI: 10.1021/jm900301y
BindingDB Entry DOI: 10.7270/Q2G44Q9K