null
SMILES: [#6]\[#6](-[#6])=[#6]\[#6]-[#7]-[#6](-[#7])=[#7]-c1ccc(-[#6]-[#7])cc1
InChI Key: InChIKey=KCPKWKCQYOFATH-UHFFFAOYSA-N
Activity Spreadsheet -- Enzyme Inhibition Constant Data from BindingDB
Found 1 hit for monomerid = 50294101
Trg + Lig
Ki
nM
ΔG°
kcal/mole
IC50
nM
Kd
nM
EC50/IC50
nM
koff
s-1
kon
M-1s-1
pHTemp
°C
Polyamine oxidase 1
(Zea mays)
BDBM50294101
(CHEMBL558092 | N1-Benzylamine-N3-(gamma,gamma-dime...)
Show SMILES [#6]\[#6](-[#6])=[#6]\[#6]-[#7]-[#6](-[#7])=[#7]-c1ccc(-[#6]-[#7])cc1 |w:8.8|
Show InChI InChI=1S/C13H20N4/c1-10(2)7-8-16-13(15)17-12-5-3-11(9-14)4-6-12/h3-7H,8-9,14H2,1-2H3,(H3,15,16,17)
1.80E+4n/an/an/an/an/an/a6.5n/a
Universit£ degli Studi di Siena
Curated by ChEMBL
Assay Description
Inhibition of maize PAO at pH 6.5 by spectrophotometry-based Dixon plot method
J Med Chem 52: 4774-85 (2009)
Article DOI: 10.1021/jm900371z
BindingDB Entry DOI: 10.7270/Q2TB16W1