BDBM50294111 1-(4-aminobutyl)-3-(3-methylbut-2-enyl)guanidine::CHEMBL111759::N-(4-Amino-butyl)-N'-(3-methyl-but-2-enyl)-guanidine::N-prenyl agmatine
SMILES: [#6]\[#6](-[#6])=[#6]\[#6]-[#7]-[#6](-[#7])=[#7]-[#6]-[#6]-[#6]-[#6]-[#7]
InChI Key: InChIKey=VACJHYSOFQSYAC-UHFFFAOYSA-N
Data: 1 KI
Activity Spreadsheet -- Enzyme Inhibition Constant Data from BindingDB
Found 1 hit for monomerid = 50294111
Trg + Lig
Ki
nM
ΔG°
kcal/mole
IC50
nM
Kd
nM
EC50/IC50
nM
koff
s-1
kon
M-1s-1
pHTemp
°C
Polyamine oxidase 1
(Zea mays)
BDBM50294111
(1-(4-aminobutyl)-3-(3-methylbut-2-enyl)guanidine |...)
Show SMILES [#6]\[#6](-[#6])=[#6]\[#6]-[#7]-[#6](-[#7])=[#7]-[#6]-[#6]-[#6]-[#6]-[#7] |w:8.8|
Show InChI InChI=1S/C10H22N4/c1-9(2)5-8-14-10(12)13-7-4-3-6-11/h5H,3-4,6-8,11H2,1-2H3,(H3,12,13,14)
15n/an/an/an/an/an/a6.5n/a
Universit£ degli Studi di Siena
Curated by ChEMBL
Assay Description
Inhibition of maize PAO at pH 6.5 by spectrophotometry-based Dixon plot method
J Med Chem 52: 4774-85 (2009)
Article DOI: 10.1021/jm900371z
BindingDB Entry DOI: 10.7270/Q2TB16W1