BDBM50294112 1-(5-aminopentyl)-3-(3-methylbut-2-enyl)guanidine::CHEMBL495424::N-(gamma,gamma-Dimethylallyl)-N-(5-aminopentyl)-guanidine
SMILES: [#6]\[#6](-[#6])=[#6]\[#6]-[#7]-[#6](-[#7])=[#7]-[#6]-[#6]-[#6]-[#6]-[#6]-[#7]
InChI Key: InChIKey=VRMFKTMYYBSTQS-UHFFFAOYSA-N
Data: 1 KI
Activity Spreadsheet -- Enzyme Inhibition Constant Data from BindingDB
Found 1 hit for monomerid = 50294112
Trg + Lig
Ki
nM
ΔG°
kcal/mole
IC50
nM
Kd
nM
EC50/IC50
nM
koff
s-1
kon
M-1s-1
pHTemp
°C
Polyamine oxidase 1
(Zea mays)
BDBM50294112
(1-(5-aminopentyl)-3-(3-methylbut-2-enyl)guanidine ...)
Show SMILES [#6]\[#6](-[#6])=[#6]\[#6]-[#7]-[#6](-[#7])=[#7]-[#6]-[#6]-[#6]-[#6]-[#6]-[#7] |w:8.8|
Show InChI InChI=1S/C11H24N4/c1-10(2)6-9-15-11(13)14-8-5-3-4-7-12/h6H,3-5,7-9,12H2,1-2H3,(H3,13,14,15)
10n/an/an/an/an/an/a6.5n/a
Universit£ degli Studi di Siena
Curated by ChEMBL
Assay Description
Inhibition of maize PAO at pH 6.5 by spectrophotometry-based Dixon plot method
J Med Chem 52: 4774-85 (2009)
Article DOI: 10.1021/jm900371z
BindingDB Entry DOI: 10.7270/Q2TB16W1
3D
3D Structure (docked)