BDBM50294200 3-(6-(4-Chlorophenyl)-2,2-dimethyl-7-phenyl-2,3-dihydro-1H-pyrrolizin-5-yl)propionic acid::CHEMBL549341
SMILES: CC1(C)Cc2c(c(c(CCC(O)=O)n2C1)-c1ccc(Cl)cc1)-c1ccccc1
InChI Key: InChIKey=ZSOORNCESLXGCL-UHFFFAOYSA-N
Data: 1 IC50
Activity Spreadsheet -- Enzyme Inhibition Constant Data from BindingDB
Found 1 hit for monomerid = 50294200
Trg + Lig
Ki
nM
ΔG°
kcal/mole
IC50
nM
Kd
nM
EC50/IC50
nM
koff
s-1
kon
M-1s-1
pHTemp
°C
Prostaglandin E synthase
(Homo sapiens (Human))
BDBM50294200
(3-(6-(4-Chlorophenyl)-2,2-dimethyl-7-phenyl-2,3-di...)
Show SMILES CC1(C)Cc2c(c(c(CCC(O)=O)n2C1)-c1ccc(Cl)cc1)-c1ccccc1
Show InChI InChI=1S/C24H24ClNO2/c1-24(2)14-20-23(16-6-4-3-5-7-16)22(17-8-10-18(25)11-9-17)19(26(20)15-24)12-13-21(27)28/h3-11H,12-15H2,1-2H3,(H,27,28)
Reactome pathway
n/an/a 7.20E+3n/an/an/an/an/an/a
Eberhard Karls University Tuebingen
Curated by ChEMBL
Assay Description
Inhibition of mPGES1 in IL-1beta treated human A549 cell microsomal membrane assessed as residual enzyme activity after 1 min by measuring PGE2 level...
J Med Chem 52: 4968-72 (2009)
Article DOI: 10.1021/jm900481c
BindingDB Entry DOI: 10.7270/Q29C6XGX