null
SMILES: [#6]-[#8]-c1ccc(-[#6]-n2c(-[#7]-[#6]-[#6]\[#7]=[#6](\[#7])-[#7])nc(=O)n(-[#6]-c3ccc(Cl)cc3)c2=O)cc1
InChI Key: InChIKey=HUCPDEBWEDCMEX-UHFFFAOYSA-N
Activity Spreadsheet -- Enzyme Inhibition Constant Data from BindingDB
Found 1 hit for monomerid = 50294596
Trg + Lig
Ki
nM
ΔG°
kcal/mole
IC50
nM
Kd
nM
EC50/IC50
nM
koff
s-1
kon
M-1s-1
pHTemp
°C
Prokineticin receptor 1
(Homo sapiens (Human))
BDBM50294596
(1-(2-(5-(4-chlorobenzyl)-1-(4-methoxybenzyl)-4,6-d...)
Show SMILES [#6]-[#8]-c1ccc(-[#6]-n2c(-[#7]-[#6]-[#6]\[#7]=[#6](\[#7])-[#7])nc(=O)n(-[#6]-c3ccc(Cl)cc3)c2=O)cc1
Show InChI InChI=1S/C21H24ClN7O3/c1-32-17-8-4-15(5-9-17)12-28-19(26-11-10-25-18(23)24)27-20(30)29(21(28)31)13-14-2-6-16(22)7-3-14/h2-9H,10-13H2,1H3,(H4,23,24,25)(H,26,27,30)
NCI pathway
Reactome pathway
n/an/a 19n/an/an/an/an/an/a
Johnson& Johnson Pharmaceutical Research and Development
Curated by ChEMBL
Assay Description
Antagonist activity at human PKR1 expressed in HEK293 cells assessed as inhibition of PK1-induced calcium mobilization by FLIPR assay
Bioorg Med Chem Lett 19: 2661-3 (2009)
Article DOI: 10.1016/j.bmcl.2009.03.157
BindingDB Entry DOI: 10.7270/Q23N23DG