null
SMILES: CCO[C@@H](Cc1ccc(OCCN2CCC(C)(C)c3cc(ccc23)C(=N\OCc2ccccc2)\c2ccccc2)cc1)C(O)=O
InChI Key: InChIKey=JRLXYWWSHLFGMT-SMCFFFHMSA-N
Activity Spreadsheet -- Enzyme Inhibition Constant Data from BindingDB
Found 3 hits for monomerid = 50294688
Trg + Lig
Ki
nM
ΔG°
kcal/mole
IC50
nM
Kd
nM
EC50/IC50
nM
koff
s-1
kon
M-1s-1
pHTemp
°C
Peroxisome proliferator-activated receptor gamma
(Homo sapiens (Human))
BDBM50294688
((S)-3-(4-(2-(6-((benzyloxyimino)(phenyl)methyl)-4,...)
Show SMILES CCO[C@@H](Cc1ccc(OCCN2CCC(C)(C)c3cc(ccc23)C(=N\OCc2ccccc2)\c2ccccc2)cc1)C(O)=O |r|
Show InChI InChI=1S/C38H42N2O5/c1-4-43-35(37(41)42)25-28-15-18-32(19-16-28)44-24-23-40-22-21-38(2,3)33-26-31(17-20-34(33)40)36(30-13-9-6-10-14-30)39-45-27-29-11-7-5-8-12-29/h5-20,26,35H,4,21-25,27H2,1-3H3,(H,41,42)/b39-36+/t35-/m0/s1
NCI pathway
Reactome pathway
18.4n/an/an/an/an/an/an/an/a
UMR GICC
Curated by ChEMBL
Assay Description
Displacement of [3H]rosiglitazone from human PPARgamma receptor
Bioorg Med Chem Lett 19: 2683-7 (2009)
Article DOI: 10.1016/j.bmcl.2009.03.143
BindingDB Entry DOI: 10.7270/Q2KP826B
Peroxisome proliferator-activated receptor gamma
(Homo sapiens (Human))
BDBM50294688
((S)-3-(4-(2-(6-((benzyloxyimino)(phenyl)methyl)-4,...)
Show SMILES CCO[C@@H](Cc1ccc(OCCN2CCC(C)(C)c3cc(ccc23)C(=N\OCc2ccccc2)\c2ccccc2)cc1)C(O)=O |r|
Show InChI InChI=1S/C38H42N2O5/c1-4-43-35(37(41)42)25-28-15-18-32(19-16-28)44-24-23-40-22-21-38(2,3)33-26-31(17-20-34(33)40)36(30-13-9-6-10-14-30)39-45-27-29-11-7-5-8-12-29/h5-20,26,35H,4,21-25,27H2,1-3H3,(H,41,42)/b39-36+/t35-/m0/s1
NCI pathway
Reactome pathway
n/an/an/an/a 7n/an/an/an/a
UMR GICC
Curated by ChEMBL
Assay Description
Agonist activity at human PPARgamma by Gal4 transactivation assay
Bioorg Med Chem Lett 19: 2683-7 (2009)
Article DOI: 10.1016/j.bmcl.2009.03.143
BindingDB Entry DOI: 10.7270/Q2KP826B
Peroxisome proliferator-activated receptor alpha
(Homo sapiens (Human))
BDBM50294688
((S)-3-(4-(2-(6-((benzyloxyimino)(phenyl)methyl)-4,...)
Show SMILES CCO[C@@H](Cc1ccc(OCCN2CCC(C)(C)c3cc(ccc23)C(=N\OCc2ccccc2)\c2ccccc2)cc1)C(O)=O |r|
Show InChI InChI=1S/C38H42N2O5/c1-4-43-35(37(41)42)25-28-15-18-32(19-16-28)44-24-23-40-22-21-38(2,3)33-26-31(17-20-34(33)40)36(30-13-9-6-10-14-30)39-45-27-29-11-7-5-8-12-29/h5-20,26,35H,4,21-25,27H2,1-3H3,(H,41,42)/b39-36+/t35-/m0/s1
n/an/an/an/a 34n/an/an/an/a
UMR GICC
Curated by ChEMBL
Assay Description
Agonist activity at human PPARalpha by Gal4 transactivation assay
Bioorg Med Chem Lett 19: 2683-7 (2009)
Article DOI: 10.1016/j.bmcl.2009.03.143
BindingDB Entry DOI: 10.7270/Q2KP826B