null
SMILES: CCCC(N(Cc1ccccc1Cl)c1ccc(C#N)c(Cl)c1)c1nncn1C
InChI Key: InChIKey=SPSACPMSSOTZPR-UHFFFAOYSA-N
Activity Spreadsheet -- Enzyme Inhibition Constant Data from BindingDB
Found 3 hits for monomerid = 50294715
Trg + Lig
Ki
nM
ΔG°
kcal/mole
IC50
nM
Kd
nM
EC50/IC50
nM
koff
s-1
kon
M-1s-1
pHTemp
°C
Progesterone receptor
(Homo sapiens (Human))
BDBM50294715
(4-((2-chlorobenzyl)(1-(4-methyl-4H-1,2,4-triazol-3...)
Show SMILES CCCC(N(Cc1ccccc1Cl)c1ccc(C#N)c(Cl)c1)c1nncn1C
Show InChI InChI=1S/C21H21Cl2N5/c1-3-6-20(21-26-25-14-27(21)2)28(13-16-7-4-5-8-18(16)22)17-10-9-15(12-24)19(23)11-17/h4-5,7-11,14,20H,3,6,13H2,1-2H3
n/an/a 13n/an/an/an/an/an/a
GlaxoSmithKline Pharmaceuticals
Curated by ChEMBL
Assay Description
Binding affinity to progesterone receptor ligand binding domain by fluorimetric assay
Bioorg Med Chem Lett 19: 2637-41 (2009)
Article DOI: 10.1016/j.bmcl.2009.03.146
BindingDB Entry DOI: 10.7270/Q2FX79GM
Cytochrome P450 2C19
(Homo sapiens (Human))
BDBM50294715
(4-((2-chlorobenzyl)(1-(4-methyl-4H-1,2,4-triazol-3...)
Show SMILES CCCC(N(Cc1ccccc1Cl)c1ccc(C#N)c(Cl)c1)c1nncn1C
Show InChI InChI=1S/C21H21Cl2N5/c1-3-6-20(21-26-25-14-27(21)2)28(13-16-7-4-5-8-18(16)22)17-10-9-15(12-24)19(23)11-17/h4-5,7-11,14,20H,3,6,13H2,1-2H3
Reactome pathway
n/an/a 110n/an/an/an/an/an/a
GlaxoSmithKline Pharmaceuticals
Curated by ChEMBL
Assay Description
Inhibition of CYP2C19
Bioorg Med Chem Lett 19: 2637-41 (2009)
Article DOI: 10.1016/j.bmcl.2009.03.146
BindingDB Entry DOI: 10.7270/Q2FX79GM
Progesterone receptor
(Homo sapiens (Human))
BDBM50294715
(4-((2-chlorobenzyl)(1-(4-methyl-4H-1,2,4-triazol-3...)
Show SMILES CCCC(N(Cc1ccccc1Cl)c1ccc(C#N)c(Cl)c1)c1nncn1C
Show InChI InChI=1S/C21H21Cl2N5/c1-3-6-20(21-26-25-14-27(21)2)28(13-16-7-4-5-8-18(16)22)17-10-9-15(12-24)19(23)11-17/h4-5,7-11,14,20H,3,6,13H2,1-2H3
n/an/an/an/a 0.0500n/an/an/an/a
GlaxoSmithKline Pharmaceuticals
Curated by ChEMBL
Assay Description
Agonist activity at progesterone receptor in human T47D cells by alkaline phosphatase release based reporter gene assay
Bioorg Med Chem Lett 19: 2637-41 (2009)
Article DOI: 10.1016/j.bmcl.2009.03.146
BindingDB Entry DOI: 10.7270/Q2FX79GM