BDBM50295174 Bengamide A::CHEMBL256279
SMILES: CCCCCCCCCCCCCC(=O)O[C@H]1CC[C@H](NC(=O)[C@H](OC)[C@H](O)[C@@H](O)[C@H](O)\C=C\C(C)C)C(=O)NC1
InChI Key: InChIKey=NKASPYGDXVCCTA-HADZOMMTSA-N
Data: 4 IC50
Activity Spreadsheet -- Enzyme Inhibition Constant Data from BindingDB
Found 4 hits for monomerid = 50295174
Trg + Lig
Ki
nM
ΔG°
kcal/mole
IC50
nM
Kd
nM
EC50/IC50
nM
koff
s-1
kon
M-1s-1
pHTemp
°C
Methionine aminopeptidase 2
(Homo sapiens (Human))
BDBM50295174
(Bengamide A | CHEMBL256279)
Show SMILES CCCCCCCCCCCCCC(=O)O[C@H]1CC[C@H](NC(=O)[C@H](OC)[C@H](O)[C@@H](O)[C@H](O)\C=C\C(C)C)C(=O)NC1 |r|
Show InChI InChI=1S/C31H56N2O8/c1-5-6-7-8-9-10-11-12-13-14-15-16-26(35)41-23-18-19-24(30(38)32-21-23)33-31(39)29(40-4)28(37)27(36)25(34)20-17-22(2)3/h17,20,22-25,27-29,34,36-37H,5-16,18-19,21H2,1-4H3,(H,32,38)(H,33,39)/b20-17+/t23-,24-,25+,27-,28+,29+/m0/s1
Reactome pathway
n/an/a 1.10E+4n/an/an/an/an/an/a
University of California Santa Cruz
Curated by ChEMBL
Assay Description
Inhibition of methionine aminopeptidase 2
J Nat Prod 72: 588-603 (2010)
Article DOI: 10.1021/np800817y
BindingDB Entry DOI: 10.7270/Q2765G84
Methionine aminopeptidase 2
(Homo sapiens (Human))
BDBM50295174
(Bengamide A | CHEMBL256279)
Show SMILES CCCCCCCCCCCCCC(=O)O[C@H]1CC[C@H](NC(=O)[C@H](OC)[C@H](O)[C@@H](O)[C@H](O)\C=C\C(C)C)C(=O)NC1 |r|
Show InChI InChI=1S/C31H56N2O8/c1-5-6-7-8-9-10-11-12-13-14-15-16-26(35)41-23-18-19-24(30(38)32-21-23)33-31(39)29(40-4)28(37)27(36)25(34)20-17-22(2)3/h17,20,22-25,27-29,34,36-37H,5-16,18-19,21H2,1-4H3,(H,32,38)(H,33,39)/b20-17+/t23-,24-,25+,27-,28+,29+/m0/s1
Reactome pathway
n/an/a 400n/an/an/an/an/an/a
Colorado Mesa University
Curated by ChEMBL
Assay Description
Inhibition of human MetAP2
J Nat Prod 80: 740-755 (2017)
Article DOI: 10.1021/acs.jnatprod.6b00970
BindingDB Entry DOI: 10.7270/Q2SN0CG4
Aminopeptidase
(Homo sapiens (Human))
BDBM50295174
(Bengamide A | CHEMBL256279)
Show SMILES CCCCCCCCCCCCCC(=O)O[C@H]1CC[C@H](NC(=O)[C@H](OC)[C@H](O)[C@@H](O)[C@H](O)\C=C\C(C)C)C(=O)NC1 |r|
Show InChI InChI=1S/C31H56N2O8/c1-5-6-7-8-9-10-11-12-13-14-15-16-26(35)41-23-18-19-24(30(38)32-21-23)33-31(39)29(40-4)28(37)27(36)25(34)20-17-22(2)3/h17,20,22-25,27-29,34,36-37H,5-16,18-19,21H2,1-4H3,(H,32,38)(H,33,39)/b20-17+/t23-,24-,25+,27-,28+,29+/m0/s1
Reactome pathway
n/an/a 700n/an/an/an/an/an/a
Colorado Mesa University
Curated by ChEMBL
Assay Description
Inhibition of human MetAP1
J Nat Prod 80: 740-755 (2017)
Article DOI: 10.1021/acs.jnatprod.6b00970
BindingDB Entry DOI: 10.7270/Q2SN0CG4
Methionine Aminopeptidase Type 1 (MetAP1)
(Homo sapiens (Human))
BDBM50295174
(Bengamide A | CHEMBL256279)
Show SMILES CCCCCCCCCCCCCC(=O)O[C@H]1CC[C@H](NC(=O)[C@H](OC)[C@H](O)[C@@H](O)[C@H](O)\C=C\C(C)C)C(=O)NC1 |r|
Show InChI InChI=1S/C31H56N2O8/c1-5-6-7-8-9-10-11-12-13-14-15-16-26(35)41-23-18-19-24(30(38)32-21-23)33-31(39)29(40-4)28(37)27(36)25(34)20-17-22(2)3/h17,20,22-25,27-29,34,36-37H,5-16,18-19,21H2,1-4H3,(H,32,38)(H,33,39)/b20-17+/t23-,24-,25+,27-,28+,29+/m0/s1
Reactome pathway
n/an/a 2.00E+3n/an/an/an/an/an/a
University of California Santa Cruz
Curated by ChEMBL
Assay Description
Inhibition of methionine aminopeptidase 1
J Nat Prod 72: 588-603 (2010)
Article DOI: 10.1021/np800817y
BindingDB Entry DOI: 10.7270/Q2765G84