BDBM50295241 11-(2-chloro-6-fluorophenyl)-8-methoxy-3,3-dimethyl-2,3,4,5,10,11-hexahydro-1H-dibenzo[b,e][1,4]diazepin-1-one::CHEMBL558803
SMILES: COc1ccc2N=C3CC(C)(C)CC(=O)C3C(Nc2c1)c1c(F)cccc1Cl
InChI Key: InChIKey=MUTFGIGDWWSLNP-UHFFFAOYSA-N
Data: 1 IC50
Activity Spreadsheet -- Enzyme Inhibition Constant Data from BindingDB
Found 1 hit for monomerid = 50295241
Trg + Lig
Ki
nM
ΔG°
kcal/mole
IC50
nM
Kd
nM
EC50/IC50
nM
koff
s-1
kon
M-1s-1
pHTemp
°C
NMBR
(Homo sapiens (Human))
BDBM50295241
(11-(2-chloro-6-fluorophenyl)-8-methoxy-3,3-dimethy...)
Show SMILES COc1ccc2N=C3CC(C)(C)CC(=O)C3C(Nc2c1)c1c(F)cccc1Cl |t:6|
Show InChI InChI=1S/C22H22ClFN2O2/c1-22(2)10-17-20(18(27)11-22)21(19-13(23)5-4-6-14(19)24)26-16-9-12(28-3)7-8-15(16)25-17/h4-9,20-21,26H,10-11H2,1-3H3
n/an/a 2.20E+3n/an/an/an/an/an/a
Amgen Inc.
Curated by ChEMBL
Assay Description
Displacement of [125I]-(D-Tyr0)NMB from human neuromedin B receptor transfected in HEK293 cells
Bioorg Med Chem Lett 19: 4264-7 (2009)
Article DOI: 10.1016/j.bmcl.2009.05.124
BindingDB Entry DOI: 10.7270/Q2C24WG8