BDBM50295249 11-(2-methoxyphenyl)-3,3,8-trimethyl-2,3,4,5,10,11-hexahydro-1H-dibenzo[b,e][1,4]diazepin-1-one::CHEMBL559859
SMILES: COc1ccccc1C1Nc2cc(C)ccc2N=C2CC(C)(C)CC(=O)C12
InChI Key: InChIKey=LJYJLZQYZZZOOL-UHFFFAOYSA-N
Data: 1 IC50
Activity Spreadsheet -- Enzyme Inhibition Constant Data from BindingDB
Found 1 hit for monomerid = 50295249
Trg + Lig
Ki
nM
ΔG°
kcal/mole
IC50
nM
Kd
nM
EC50/IC50
nM
koff
s-1
kon
M-1s-1
pHTemp
°C
NMBR
(Homo sapiens (Human))
BDBM50295249
(11-(2-methoxyphenyl)-3,3,8-trimethyl-2,3,4,5,10,11...)
Show SMILES COc1ccccc1C1Nc2cc(C)ccc2N=C2CC(C)(C)CC(=O)C12 |t:19|
Show InChI InChI=1S/C23H26N2O2/c1-14-9-10-16-17(11-14)25-22(15-7-5-6-8-20(15)27-4)21-18(24-16)12-23(2,3)13-19(21)26/h5-11,21-22,25H,12-13H2,1-4H3
n/an/a 1.10E+3n/an/an/an/an/an/a
Amgen Inc.
Curated by ChEMBL
Assay Description
Displacement of [125I]-(D-Tyr0)NMB from human neuromedin B receptor transfected in HEK293 cells
Bioorg Med Chem Lett 19: 4264-7 (2009)
Article DOI: 10.1016/j.bmcl.2009.05.124
BindingDB Entry DOI: 10.7270/Q2C24WG8