BDBM50295250 11-(2-fluorophenyl)-3,3,8-trimethyl-2,3,4,5,10,11-hexahydro-1H-dibenzo[b,e][1,4]diazepin-1-one::CHEMBL549567
SMILES: Cc1ccc2N=C3CC(C)(C)CC(=O)C3C(Nc2c1)c1ccccc1F
InChI Key: InChIKey=ZSBMMHHNMNYYCN-UHFFFAOYSA-N
Data: 1 IC50
Activity Spreadsheet -- Enzyme Inhibition Constant Data from BindingDB
Found 1 hit for monomerid = 50295250
Trg + Lig
Ki
nM
ΔG°
kcal/mole
IC50
nM
Kd
nM
EC50/IC50
nM
koff
s-1
kon
M-1s-1
pHTemp
°C
NMBR
(Homo sapiens (Human))
BDBM50295250
(11-(2-fluorophenyl)-3,3,8-trimethyl-2,3,4,5,10,11-...)
Show SMILES Cc1ccc2N=C3CC(C)(C)CC(=O)C3C(Nc2c1)c1ccccc1F |t:5|
Show InChI InChI=1S/C22H23FN2O/c1-13-8-9-16-17(10-13)25-21(14-6-4-5-7-15(14)23)20-18(24-16)11-22(2,3)12-19(20)26/h4-10,20-21,25H,11-12H2,1-3H3
n/an/a 1.30E+3n/an/an/an/an/an/a
Amgen Inc.
Curated by ChEMBL
Assay Description
Displacement of [125I]-(D-Tyr0)NMB from human neuromedin B receptor transfected in HEK293 cells
Bioorg Med Chem Lett 19: 4264-7 (2009)
Article DOI: 10.1016/j.bmcl.2009.05.124
BindingDB Entry DOI: 10.7270/Q2C24WG8